BDBM50188169 4-[(2S)-3-{[(2S)-1-amino-3-(4-hydroxyphenyl)propan-2-yl]amino}-2-(ethylamino)propyl]phenol::CHEMBL211895
SMILES: CCN[C@H](CN[C@H](CN)Cc1ccc(O)cc1)Cc1ccc(O)cc1
InChI Key: InChIKey=BAYWFUYMXDWMLB-ROUUACIJSA-N
Data: 1 IC50
Activity Spreadsheet -- Enzyme Inhibition Constant Data from BindingDB
Found 1 hit for monomerid = 50188169
Trg + Lig
Ki
nM
ΔG°
kcal/mole
IC50
nM
Kd
nM
EC50/IC50
nM
koff
s-1
kon
M-1s-1
pHTemp
°C
Mu-type opioid receptor
(Rattus norvegicus (rat))
BDBM50188169
(4-[(2S)-3-{[(2S)-1-amino-3-(4-hydroxyphenyl)propan...)
Show SMILES CCN[C@H](CN[C@H](CN)Cc1ccc(O)cc1)Cc1ccc(O)cc1
Show InChI InChI=1S/C20H29N3O2/c1-2-22-18(12-16-5-9-20(25)10-6-16)14-23-17(13-21)11-15-3-7-19(24)8-4-15/h3-10,17-18,22-25H,2,11-14,21H2,1H3/t17-,18-/m0/s1
Reactome pathway
n/an/a 344n/an/an/an/an/an/a
Institute for Molecular Studies
Curated by ChEMBL
Assay Description
Displacement of [3H]DAMGO from mu opioid receptor in rat brain homogenate
Bioorg Med Chem Lett 16: 4331-8 (2006)
Article DOI: 10.1016/j.bmcl.2006.05.053
BindingDB Entry DOI: 10.7270/Q2028R47