BDBM50188520 Arg-Lys::CHEMBL380024
SMILES: [#7]-[#6]-[#6]-[#6]-[#6]-[#6@H](-[#7]-[#6](=O)-[#6@@H](-[#7])-[#6]-[#6]-[#6]\[#7]=[#6](\[#7])-[#7])-[#6](-[#8])=O
InChI Key: InChIKey=JQFZHHSQMKZLRU-IUCAKERBSA-N
Data: 1 IC50
Activity Spreadsheet -- Enzyme Inhibition Constant Data from BindingDB
Found 1 hit for monomerid = 50188520
Trg + Lig
Ki
nM
ΔG°
kcal/mole
IC50
nM
Kd
nM
EC50/IC50
nM
koff
s-1
kon
M-1s-1
pHTemp
°C
Oligopeptide transporter small intestine isoform
(Homo sapiens (Human))
BDBM50188520
(Arg-Lys | CHEMBL380024)
Show SMILES [#7]-[#6]-[#6]-[#6]-[#6]-[#6@H](-[#7]-[#6](=O)-[#6@@H](-[#7])-[#6]-[#6]-[#6]\[#7]=[#6](\[#7])-[#7])-[#6](-[#8])=O
Show InChI InChI=1S/C12H26N6O3/c13-6-2-1-5-9(11(20)21)18-10(19)8(14)4-3-7-17-12(15)16/h8-9H,1-7,13-14H2,(H,18,19)(H,20,21)(H4,15,16,17)/t8-,9-/m0/s1
Reactome pathway
n/an/a 8.11E+6n/an/an/an/an/an/a
Pharmaceutical Research Institute
Curated by ChEMBL
Assay Description
Binding affinity to human PEPT1 assessed as inhibition of [14C]Gly-Sar uptake in MDCK cells
J Med Chem 49: 3636-44 (2006)
Article DOI: 10.1021/jm0511029
BindingDB Entry DOI: 10.7270/Q2P55P9R