null
SMILES: COC(=O)C(Cc1ccc(NS([O-])(=O)=O)cc1)(Cc1cccc(OC)c1)C(=O)OC
InChI Key: InChIKey=QUDCIWWZPBQGSG-UHFFFAOYSA-M
Activity Spreadsheet -- Enzyme Inhibition Constant Data from BindingDB
Found 1 hit for monomerid = 50188796
Trg + Lig
Ki
nM
ΔG°
kcal/mole
IC50
nM
Kd
nM
EC50/IC50
nM
koff
s-1
kon
M-1s-1
pHTemp
°C
Receptor-type tyrosine-protein phosphatase beta
(Homo sapiens (Human))
BDBM50188796
(CHEMBL213728 | ammonium N-{4-[3-methoxy-2-(methoxy...)
Show SMILES COC(=O)C(Cc1ccc(NS([O-])(=O)=O)cc1)(Cc1cccc(OC)c1)C(=O)OC
Show InChI InChI=1S/C20H23NO8S/c1-27-17-6-4-5-15(11-17)13-20(18(22)28-2,19(23)29-3)12-14-7-9-16(10-8-14)21-30(24,25)26/h4-11,21H,12-13H2,1-3H3,(H,24,25,26)/p-1
n/an/a 330n/an/an/an/an/an/a
Procter & Gamble Pharmaceuticals
Curated by ChEMBL
Assay Description
Inhibition of HPTPbeta
Bioorg Med Chem Lett 16: 4252-6 (2006)
Article DOI: 10.1016/j.bmcl.2006.05.074
BindingDB Entry DOI: 10.7270/Q2D50MK4