null
SMILES: CCCC[C@]12Cc3c(ccc4nn[nH]c34)C1=C(c1cccs1)C(=O)CC2
InChI Key: InChIKey=TZACYAAFEOUQNL-NRFANRHFSA-N
Activity Spreadsheet -- Enzyme Inhibition Constant Data from BindingDB
Found 4 hits for monomerid = 50189069
Trg + Lig
Ki
nM
ΔG°
kcal/mole
IC50
nM
Kd
nM
EC50/IC50
nM
koff
s-1
kon
M-1s-1
pHTemp
°C
Estrogen receptor
(Homo sapiens (Human))
BDBM50189069
((S)(-)-9a-butyl-6-thiophen-2-yl-8,9,9a,10-tetrahyd...)
Show SMILES CCCC[C@]12Cc3c(ccc4nn[nH]c34)C1=C(c1cccs1)C(=O)CC2 |t:18|
Show InChI InChI=1S/C21H21N3OS/c1-2-3-9-21-10-8-16(25)18(17-5-4-11-26-17)19(21)13-6-7-15-20(14(13)12-21)23-24-22-15/h4-7,11H,2-3,8-10,12H2,1H3,(H,22,23,24)/t21-/m0/s1
n/an/a 34n/an/an/an/an/an/a
Merck Research Laboratories
Curated by ChEMBL
Assay Description
Binding affinity to human recombinant ERalpha by scintillation proximity assay
Bioorg Med Chem Lett 16: 4652-6 (2006)
Article DOI: 10.1016/j.bmcl.2006.05.103
BindingDB Entry DOI: 10.7270/Q2MP52WG
Estrogen receptor beta
(Homo sapiens (Human))
BDBM50189069
((S)(-)-9a-butyl-6-thiophen-2-yl-8,9,9a,10-tetrahyd...)
Show SMILES CCCC[C@]12Cc3c(ccc4nn[nH]c34)C1=C(c1cccs1)C(=O)CC2 |t:18|
Show InChI InChI=1S/C21H21N3OS/c1-2-3-9-21-10-8-16(25)18(17-5-4-11-26-17)19(21)13-6-7-15-20(14(13)12-21)23-24-22-15/h4-7,11H,2-3,8-10,12H2,1H3,(H,22,23,24)/t21-/m0/s1
n/an/a 2.30n/an/an/an/an/an/a
Merck Research Laboratories
Curated by ChEMBL
Assay Description
Binding affinity to human recombinant ERbeta by scintillation proximity assay
Bioorg Med Chem Lett 16: 4652-6 (2006)
Article DOI: 10.1016/j.bmcl.2006.05.103
BindingDB Entry DOI: 10.7270/Q2MP52WG
Estrogen receptor beta
(Homo sapiens (Human))
BDBM50189069
((S)(-)-9a-butyl-6-thiophen-2-yl-8,9,9a,10-tetrahyd...)
Show SMILES CCCC[C@]12Cc3c(ccc4nn[nH]c34)C1=C(c1cccs1)C(=O)CC2 |t:18|
Show InChI InChI=1S/C21H21N3OS/c1-2-3-9-21-10-8-16(25)18(17-5-4-11-26-17)19(21)13-6-7-15-20(14(13)12-21)23-24-22-15/h4-7,11H,2-3,8-10,12H2,1H3,(H,22,23,24)/t21-/m0/s1
n/an/an/an/a 0.960n/an/an/an/a
Merck Research Laboratories
Curated by ChEMBL
Assay Description
Agonist activity at human recombinant ERbeta expressed in HEK293 cells by alkaline phosphatase reporter gene transactivation assay
Bioorg Med Chem Lett 16: 4652-6 (2006)
Article DOI: 10.1016/j.bmcl.2006.05.103
BindingDB Entry DOI: 10.7270/Q2MP52WG
Estrogen receptor
(Homo sapiens (Human))
BDBM50189069
((S)(-)-9a-butyl-6-thiophen-2-yl-8,9,9a,10-tetrahyd...)
Show SMILES CCCC[C@]12Cc3c(ccc4nn[nH]c34)C1=C(c1cccs1)C(=O)CC2 |t:18|
Show InChI InChI=1S/C21H21N3OS/c1-2-3-9-21-10-8-16(25)18(17-5-4-11-26-17)19(21)13-6-7-15-20(14(13)12-21)23-24-22-15/h4-7,11H,2-3,8-10,12H2,1H3,(H,22,23,24)/t21-/m0/s1
n/an/an/an/a 79n/an/an/an/a
Merck Research Laboratories
Curated by ChEMBL
Assay Description
Agonist activity at human recombinant ERalpha expressed in HEK293 cells by alkaline phosphatase reporter gene transactivation assay
Bioorg Med Chem Lett 16: 4652-6 (2006)
Article DOI: 10.1016/j.bmcl.2006.05.103
BindingDB Entry DOI: 10.7270/Q2MP52WG