BDBM50189078 (S)(-)-9a-Butyl-6-ethyl-8,9,9a,10-tetrahydro-3H-1,2,3-triaza-cyclopenta[a]fluoren-7-one::CHEMBL441366
SMILES: CCCC[C@]12Cc3c(ccc4nn[nH]c34)C1=C(CC)C(=O)CC2
InChI Key: InChIKey=PYWHZNIQLVXCCU-IBGZPJMESA-N
Data: 2 IC50  2 EC50
Activity Spreadsheet -- Enzyme Inhibition Constant Data from BindingDB
Found 4 hits for monomerid = 50189078
Trg + Lig
Ki
nM
ΔG°
kcal/mole
IC50
nM
Kd
nM
EC50/IC50
nM
koff
s-1
kon
M-1s-1
pHTemp
°C
Estrogen receptor
(Homo sapiens (Human))
BDBM50189078
((S)(-)-9a-Butyl-6-ethyl-8,9,9a,10-tetrahydro-3H-1,...)
Show SMILES CCCC[C@]12Cc3c(ccc4nn[nH]c34)C1=C(CC)C(=O)CC2 |t:18|
Show InChI InChI=1S/C19H23N3O/c1-3-5-9-19-10-8-16(23)12(4-2)17(19)13-6-7-15-18(14(13)11-19)21-22-20-15/h6-7H,3-5,8-11H2,1-2H3,(H,20,21,22)/t19-/m0/s1
n/an/a 220n/an/an/an/an/an/a
Merck Research Laboratories
Curated by ChEMBL
Assay Description
Binding affinity to human recombinant ERalpha by scintillation proximity assay
Bioorg Med Chem Lett 16: 4652-6 (2006)
Article DOI: 10.1016/j.bmcl.2006.05.103
BindingDB Entry DOI: 10.7270/Q2MP52WG
Estradiol receptor beta (ERβ)
(Homo sapiens (Human))
BDBM50189078
((S)(-)-9a-Butyl-6-ethyl-8,9,9a,10-tetrahydro-3H-1,...)
Show SMILES CCCC[C@]12Cc3c(ccc4nn[nH]c34)C1=C(CC)C(=O)CC2 |t:18|
Show InChI InChI=1S/C19H23N3O/c1-3-5-9-19-10-8-16(23)12(4-2)17(19)13-6-7-15-18(14(13)11-19)21-22-20-15/h6-7H,3-5,8-11H2,1-2H3,(H,20,21,22)/t19-/m0/s1
n/an/an/an/a 0.400n/an/an/an/a
Merck Research Laboratories
Curated by ChEMBL
Assay Description
Agonist activity at human recombinant ERbeta expressed in HEK293 cells by alkaline phosphatase reporter gene transactivation assay
Bioorg Med Chem Lett 16: 4652-6 (2006)
Article DOI: 10.1016/j.bmcl.2006.05.103
BindingDB Entry DOI: 10.7270/Q2MP52WG
Estradiol receptor beta (ERβ)
(Homo sapiens (Human))
BDBM50189078
((S)(-)-9a-Butyl-6-ethyl-8,9,9a,10-tetrahydro-3H-1,...)
Show SMILES CCCC[C@]12Cc3c(ccc4nn[nH]c34)C1=C(CC)C(=O)CC2 |t:18|
Show InChI InChI=1S/C19H23N3O/c1-3-5-9-19-10-8-16(23)12(4-2)17(19)13-6-7-15-18(14(13)11-19)21-22-20-15/h6-7H,3-5,8-11H2,1-2H3,(H,20,21,22)/t19-/m0/s1
n/an/a 5.10n/an/an/an/an/an/a
Merck Research Laboratories
Curated by ChEMBL
Assay Description
Binding affinity to human recombinant ERbeta by scintillation proximity assay
Bioorg Med Chem Lett 16: 4652-6 (2006)
Article DOI: 10.1016/j.bmcl.2006.05.103
BindingDB Entry DOI: 10.7270/Q2MP52WG
Estrogen receptor
(Homo sapiens (Human))
BDBM50189078
((S)(-)-9a-Butyl-6-ethyl-8,9,9a,10-tetrahydro-3H-1,...)
Show SMILES CCCC[C@]12Cc3c(ccc4nn[nH]c34)C1=C(CC)C(=O)CC2 |t:18|
Show InChI InChI=1S/C19H23N3O/c1-3-5-9-19-10-8-16(23)12(4-2)17(19)13-6-7-15-18(14(13)11-19)21-22-20-15/h6-7H,3-5,8-11H2,1-2H3,(H,20,21,22)/t19-/m0/s1
n/an/an/an/a 30n/an/an/an/a
Merck Research Laboratories
Curated by ChEMBL
Assay Description
Agonist activity at human recombinant ERalpha expressed in HEK293 cells by alkaline phosphatase reporter gene transactivation assay
Bioorg Med Chem Lett 16: 4652-6 (2006)
Article DOI: 10.1016/j.bmcl.2006.05.103
BindingDB Entry DOI: 10.7270/Q2MP52WG