BDBM50189080 (S)(-)-6,9a-diethyl-8,9,9a,10-tetrahydro-3H-1,2,3-triaza-cyclopenta[a]fluoren-7-one::CHEMBL385949
SMILES: CCC1=C2c3ccc4nn[nH]c4c3C[C@]2(CC)CCC1=O
InChI Key: InChIKey=ZZRJPSUBAGGGKW-KRWDZBQOSA-N
Data: 2 IC50  2 EC50
Activity Spreadsheet -- Enzyme Inhibition Constant Data from BindingDB
Found 4 hits for monomerid = 50189080
Trg + Lig
Ki
nM
ΔG°
kcal/mole
IC50
nM
Kd
nM
EC50/IC50
nM
koff
s-1
kon
M-1s-1
pHTemp
°C
Estrogen receptor
(Homo sapiens (Human))
BDBM50189080
((S)(-)-6,9a-diethyl-8,9,9a,10-tetrahydro-3H-1,2,3-...)
Show SMILES CCC1=C2c3ccc4nn[nH]c4c3C[C@]2(CC)CCC1=O |c:2|
Show InChI InChI=1S/C17H19N3O/c1-3-10-14(21)7-8-17(4-2)9-12-11(15(10)17)5-6-13-16(12)19-20-18-13/h5-6H,3-4,7-9H2,1-2H3,(H,18,19,20)/t17-/m0/s1
n/an/a 647n/an/an/an/an/an/a
Merck Research Laboratories
Curated by ChEMBL
Assay Description
Binding affinity to human recombinant ERalpha by scintillation proximity assay
Bioorg Med Chem Lett 16: 4652-6 (2006)
Article DOI: 10.1016/j.bmcl.2006.05.103
BindingDB Entry DOI: 10.7270/Q2MP52WG
Estrogen receptor
(Homo sapiens (Human))
BDBM50189080
((S)(-)-6,9a-diethyl-8,9,9a,10-tetrahydro-3H-1,2,3-...)
Show SMILES CCC1=C2c3ccc4nn[nH]c4c3C[C@]2(CC)CCC1=O |c:2|
Show InChI InChI=1S/C17H19N3O/c1-3-10-14(21)7-8-17(4-2)9-12-11(15(10)17)5-6-13-16(12)19-20-18-13/h5-6H,3-4,7-9H2,1-2H3,(H,18,19,20)/t17-/m0/s1
n/an/an/an/a 140n/an/an/an/a
Merck Research Laboratories
Curated by ChEMBL
Assay Description
Agonist activity at human recombinant ERalpha expressed in HEK293 cells by alkaline phosphatase reporter gene transactivation assay
Bioorg Med Chem Lett 16: 4652-6 (2006)
Article DOI: 10.1016/j.bmcl.2006.05.103
BindingDB Entry DOI: 10.7270/Q2MP52WG
Estradiol receptor beta (ERβ)
(Homo sapiens (Human))
BDBM50189080
((S)(-)-6,9a-diethyl-8,9,9a,10-tetrahydro-3H-1,2,3-...)
Show SMILES CCC1=C2c3ccc4nn[nH]c4c3C[C@]2(CC)CCC1=O |c:2|
Show InChI InChI=1S/C17H19N3O/c1-3-10-14(21)7-8-17(4-2)9-12-11(15(10)17)5-6-13-16(12)19-20-18-13/h5-6H,3-4,7-9H2,1-2H3,(H,18,19,20)/t17-/m0/s1
n/an/a 5.70n/an/an/an/an/an/a
Merck Research Laboratories
Curated by ChEMBL
Assay Description
Binding affinity to human recombinant ERbeta by scintillation proximity assay
Bioorg Med Chem Lett 16: 4652-6 (2006)
Article DOI: 10.1016/j.bmcl.2006.05.103
BindingDB Entry DOI: 10.7270/Q2MP52WG
Estradiol receptor beta (ERβ)
(Homo sapiens (Human))
BDBM50189080
((S)(-)-6,9a-diethyl-8,9,9a,10-tetrahydro-3H-1,2,3-...)
Show SMILES CCC1=C2c3ccc4nn[nH]c4c3C[C@]2(CC)CCC1=O |c:2|
Show InChI InChI=1S/C17H19N3O/c1-3-10-14(21)7-8-17(4-2)9-12-11(15(10)17)5-6-13-16(12)19-20-18-13/h5-6H,3-4,7-9H2,1-2H3,(H,18,19,20)/t17-/m0/s1
n/an/an/an/a 5.80n/an/an/an/a
Merck Research Laboratories
Curated by ChEMBL
Assay Description
Agonist activity at human recombinant ERbeta expressed in HEK293 cells by alkaline phosphatase reporter gene transactivation assay
Bioorg Med Chem Lett 16: 4652-6 (2006)
Article DOI: 10.1016/j.bmcl.2006.05.103
BindingDB Entry DOI: 10.7270/Q2MP52WG