BDBM50189130 (2S,4aR,6aR,7R,9S,10aS,10bR)-methyl 9-(dimethylamino)-2-(furan-3-yl)-6a,10b-dimethyl-4,10-dioxo-dodecahydro-1H-benzo[f]isochromene-7-carboxylate::CHEMBL212483
SMILES: COC(=O)[C@@H]1C[C@H](N(C)C)C(=O)[C@H]2[C@@]1(C)CC[C@H]1C(=O)O[C@@H](C[C@]21C)c1ccoc1
InChI Key: InChIKey=QFWDZXVIJNCCSH-AGQYDFLVSA-N
Data: 1 KI  1 EC50
Activity Spreadsheet -- Enzyme Inhibition Constant Data from BindingDB
Found 2 hits for monomerid = 50189130
Trg + Lig
Ki
nM
ΔG°
kcal/mole
IC50
nM
Kd
nM
EC50/IC50
nM
koff
s-1
kon
M-1s-1
pHTemp
°C
Kappa-type opioid receptor
(Homo sapiens (Human))
BDBM50189130
((2S,4aR,6aR,7R,9S,10aS,10bR)-methyl 9-(dimethylami...)
Show SMILES COC(=O)[C@@H]1C[C@H](N(C)C)C(=O)[C@H]2[C@@]1(C)CC[C@H]1C(=O)O[C@@H](C[C@]21C)c1ccoc1
Show InChI InChI=1S/C23H31NO6/c1-22-8-6-14-21(27)30-17(13-7-9-29-12-13)11-23(14,2)19(22)18(25)16(24(3)4)10-15(22)20(26)28-5/h7,9,12,14-17,19H,6,8,10-11H2,1-5H3/t14-,15-,16-,17-,19-,22-,23-/m0/s1
Reactome pathway
168n/an/an/an/an/an/an/an/a
McLean Hospital
Curated by ChEMBL
Assay Description
Inhibition of [3H]diprenorphine binding to human KOR expressed in CHO cells
Bioorg Med Chem Lett 16: 4679-85 (2006)
Article DOI: 10.1016/j.bmcl.2006.05.093
BindingDB Entry DOI: 10.7270/Q2GX4B55
Kappa-type opioid receptor
(Homo sapiens (Human))
BDBM50189130
((2S,4aR,6aR,7R,9S,10aS,10bR)-methyl 9-(dimethylami...)
Show SMILES COC(=O)[C@@H]1C[C@H](N(C)C)C(=O)[C@H]2[C@@]1(C)CC[C@H]1C(=O)O[C@@H](C[C@]21C)c1ccoc1
Show InChI InChI=1S/C23H31NO6/c1-22-8-6-14-21(27)30-17(13-7-9-29-12-13)11-23(14,2)19(22)18(25)16(24(3)4)10-15(22)20(26)28-5/h7,9,12,14-17,19H,6,8,10-11H2,1-5H3/t14-,15-,16-,17-,19-,22-,23-/m0/s1
Reactome pathway
n/an/an/an/a 240n/an/an/an/a
McLean Hospital
Curated by ChEMBL
Assay Description
Enhancement of [35S]GTPgammaS binding to human KOR expressed in CHO cells
Bioorg Med Chem Lett 16: 4679-85 (2006)
Article DOI: 10.1016/j.bmcl.2006.05.093
BindingDB Entry DOI: 10.7270/Q2GX4B55