BDBM50189158 (2S,4aR,6aR,7R,9S,10aS,10bR)-methyl 2-(furan-3-yl)-9-(isopropylamino)-6a,10b-dimethyl-4,10-dioxo-dodecahydro-1H-benzo[f]isochromene-7-carboxylate::CHEMBL212435
SMILES: COC(=O)[C@@H]1C[C@H](NC(C)C)C(=O)[C@H]2[C@@]1(C)CC[C@H]1C(=O)O[C@@H](C[C@]21C)c1ccoc1
InChI Key: InChIKey=JBDNNHQZUREDCQ-WFOQEEKOSA-N
Data: 1 KI  1 EC50
Activity Spreadsheet -- Enzyme Inhibition Constant Data from BindingDB
Found 2 hits for monomerid = 50189158
Trg + Lig
Ki
nM
ΔG°
kcal/mole
IC50
nM
Kd
nM
EC50/IC50
nM
koff
s-1
kon
M-1s-1
pHTemp
°C
Kappa-type opioid receptor
(Homo sapiens (Human))
BDBM50189158
((2S,4aR,6aR,7R,9S,10aS,10bR)-methyl 2-(furan-3-yl)...)
Show SMILES COC(=O)[C@@H]1C[C@H](NC(C)C)C(=O)[C@H]2[C@@]1(C)CC[C@H]1C(=O)O[C@@H](C[C@]21C)c1ccoc1
Show InChI InChI=1S/C24H33NO6/c1-13(2)25-17-10-16(21(27)29-5)23(3)8-6-15-22(28)31-18(14-7-9-30-12-14)11-24(15,4)20(23)19(17)26/h7,9,12-13,15-18,20,25H,6,8,10-11H2,1-5H3/t15-,16-,17-,18-,20-,23-,24-/m0/s1
Reactome pathway
18n/an/an/an/an/an/an/an/a
McLean Hospital
Curated by ChEMBL
Assay Description
Inhibition of [3H]diprenorphine binding to human KOR expressed in CHO cells
Bioorg Med Chem Lett 16: 4679-85 (2006)
Article DOI: 10.1016/j.bmcl.2006.05.093
BindingDB Entry DOI: 10.7270/Q2GX4B55
Kappa-type opioid receptor
(Homo sapiens (Human))
BDBM50189158
((2S,4aR,6aR,7R,9S,10aS,10bR)-methyl 2-(furan-3-yl)...)
Show SMILES COC(=O)[C@@H]1C[C@H](NC(C)C)C(=O)[C@H]2[C@@]1(C)CC[C@H]1C(=O)O[C@@H](C[C@]21C)c1ccoc1
Show InChI InChI=1S/C24H33NO6/c1-13(2)25-17-10-16(21(27)29-5)23(3)8-6-15-22(28)31-18(14-7-9-30-12-14)11-24(15,4)20(23)19(17)26/h7,9,12-13,15-18,20,25H,6,8,10-11H2,1-5H3/t15-,16-,17-,18-,20-,23-,24-/m0/s1
Reactome pathway
n/an/an/an/a 19n/an/an/an/a
McLean Hospital
Curated by ChEMBL
Assay Description
Enhancement of [35S]GTPgammaS binding to human KOR expressed in CHO cells
Bioorg Med Chem Lett 16: 4679-85 (2006)
Article DOI: 10.1016/j.bmcl.2006.05.093
BindingDB Entry DOI: 10.7270/Q2GX4B55