BDBM50189240 (R)-2-(2-(4-methoxyphenyl)furan-5-carboxamido)-3-(3,7,11-trimethyldodeca-2,6,10-trienylthio)propanoic acid::CHEMBL213243
SMILES: [#6]-[#8]-c1ccc(cc1)-c1ccc(o1)-[#6](=O)-[#7]-[#6@@H](-[#6]-[#16]-[#6]\[#6]=[#6](/[#6])-[#6]-[#6]\[#6]=[#6](/[#6])-[#6]-[#6]\[#6]=[#6](\[#6])-[#6])-[#6](-[#8])=O
InChI Key: InChIKey=FKXMLKCACUZGFO-PLFWPOPISA-N
Data: 1 IC50
Activity Spreadsheet -- Enzyme Inhibition Constant Data from BindingDB
Found 1 hit for monomerid = 50189240
Trg + Lig
Ki
nM
ΔG°
kcal/mole
IC50
nM
Kd
nM
EC50/IC50
nM
koff
s-1
kon
M-1s-1
pHTemp
°C
Isoprenylcysteine carboxyl methyltransferase
(Homo sapiens (Human))
BDBM50189240
((R)-2-(2-(4-methoxyphenyl)furan-5-carboxamido)-3-(...)
Show SMILES [#6]-[#8]-c1ccc(cc1)-c1ccc(o1)-[#6](=O)-[#7]-[#6@@H](-[#6]-[#16]-[#6]\[#6]=[#6](/[#6])-[#6]-[#6]\[#6]=[#6](/[#6])-[#6]-[#6]\[#6]=[#6](\[#6])-[#6])-[#6](-[#8])=O
Show InChI InChI=1S/C30H39NO5S/c1-21(2)8-6-9-22(3)10-7-11-23(4)18-19-37-20-26(30(33)34)31-29(32)28-17-16-27(36-28)24-12-14-25(35-5)15-13-24/h8,10,12-18,26H,6-7,9,11,19-20H2,1-5H3,(H,31,32)(H,33,34)/b22-10+,23-18+/t26-/m0/s1
n/an/a 1.74E+4n/an/an/an/an/an/a
Purdue University
Curated by ChEMBL
Assay Description
Inhibition of human Icmt by methanol vapour diffusion assay
Bioorg Med Chem Lett 16: 4420-3 (2006)
Article DOI: 10.1016/j.bmcl.2006.05.029
BindingDB Entry DOI: 10.7270/Q27D2TRG