BDBM50189609 CHEMBL209555::N-cyclopropyl-4-fluoro-3-(2-(2-(pyridin-2-ylamino)thiazol-5-yl)ethyl)benzamide
SMILES: Fc1ccc(cc1CCc1cnc(Nc2ccccn2)s1)C(=O)NC1CC1
InChI Key: InChIKey=CMTFYUMOJRAUPR-UHFFFAOYSA-N
Data: 1 IC50
Activity Spreadsheet -- Enzyme Inhibition Constant Data from BindingDB
Found 1 hit for monomerid = 50189609
Trg + Lig
Ki
nM
ΔG°
kcal/mole
IC50
nM
Kd
nM
EC50/IC50
nM
koff
s-1
kon
M-1s-1
pHTemp
°C
Vascular endothelial growth factor receptor 2
(Homo sapiens (Human))
BDBM50189609
(CHEMBL209555 | N-cyclopropyl-4-fluoro-3-(2-(2-(pyr...)
Show SMILES Fc1ccc(cc1CCc1cnc(Nc2ccccn2)s1)C(=O)NC1CC1
Show InChI InChI=1S/C20H19FN4OS/c21-17-9-5-14(19(26)24-15-6-7-15)11-13(17)4-8-16-12-23-20(27-16)25-18-3-1-2-10-22-18/h1-3,5,9-12,15H,4,6-8H2,(H,24,26)(H,22,23,25)
NCI pathway
Reactome pathway
n/an/a 14n/an/an/an/an/an/a
Bristol-Myers Squibb Pharmaceutical Research Institute
Curated by ChEMBL
Assay Description
Inhibition of FLK1
J Med Chem 49: 3766-9 (2006)
Article DOI: 10.1021/jm060347y
BindingDB Entry DOI: 10.7270/Q2PG1RBM