BDBM50189761 5-[5-(3-methoxyphenyl)furan-2-ylmethylene]thiazolidine-2,4-dione::CHEMBL209409
SMILES: COc1cccc(c1)-c1ccc(C=C2SC(O)=NC2=O)o1
InChI Key: InChIKey=JNSQQZAEQIEADH-UHFFFAOYSA-N
Data: 2 IC50
Activity Spreadsheet -- Enzyme Inhibition Constant Data from BindingDB
Found 2 hits for monomerid = 50189761
Trg + Lig
Ki
nM
ΔG°
kcal/mole
IC50
nM
Kd
nM
EC50/IC50
nM
koff
s-1
kon
M-1s-1
pHTemp
°C
Phosphatidylinositol 4,5-bisphosphate 3-kinase catalytic subunit gamma isoform
(Homo sapiens (Human))
BDBM50189761
(5-[5-(3-methoxyphenyl)furan-2-ylmethylene]thiazoli...)
Show SMILES COc1cccc(c1)-c1ccc(C=C2SC(O)=NC2=O)o1 |w:12.12,c:17|
Show InChI InChI=1S/C15H11NO4S/c1-19-10-4-2-3-9(7-10)12-6-5-11(20-12)8-13-14(17)16-15(18)21-13/h2-8H,1H3,(H,16,17,18)
NCI pathway
Reactome pathway
n/an/a 2.60E+3n/an/an/an/an/an/a
Serono Pharmaceutical Research Institute
Curated by ChEMBL
Assay Description
Inhibition of human PI3Kgamma
J Med Chem 49: 3857-71 (2006)
Article DOI: 10.1021/jm0601598
BindingDB Entry DOI: 10.7270/Q2DZ07X0
Phosphatidylinositol 4,5-bisphosphate 3-kinase catalytic subunit gamma isoform
(Homo sapiens (Human))
BDBM50189761
(5-[5-(3-methoxyphenyl)furan-2-ylmethylene]thiazoli...)
Show SMILES COc1cccc(c1)-c1ccc(C=C2SC(O)=NC2=O)o1 |w:12.12,c:17|
Show InChI InChI=1S/C15H11NO4S/c1-19-10-4-2-3-9(7-10)12-6-5-11(20-12)8-13-14(17)16-15(18)21-13/h2-8H,1H3,(H,16,17,18)
NCI pathway
Reactome pathway
n/an/a 2.60E+3n/an/an/an/an/an/a
The University of Jordan
Curated by ChEMBL
Assay Description
Inhibition of PI3Kgamma (unknown origin) assessed as decrease in fluorescence intensity using phosphorylated substrate
Eur J Med Chem 84: 454-65 (2014)
Article DOI: 10.1016/j.ejmech.2014.07.056
BindingDB Entry DOI: 10.7270/Q2057HM8