BDBM50189791 CHEMBL3827145
SMILES: C(Oc1ccc2[nH]nc(-c3nc4cc(ccc4[nH]3)N3CCCCC3)c2c1)c1cccnc1
InChI Key: InChIKey=GLMOWJZAIYMEMR-UHFFFAOYSA-N
Data: 1 IC50
Activity Spreadsheet -- Enzyme Inhibition Constant Data from BindingDB
Found 1 hit for monomerid = 50189791
Trg + Lig
Ki
nM
ΔG°
kcal/mole
IC50
nM
Kd
nM
EC50/IC50
nM
koff
s-1
kon
M-1s-1
pHTemp
°C
Fibroblast growth factor receptor 1
(Homo sapiens (Human))
BDBM50189791
(CHEMBL3827145)
Show SMILES C(Oc1ccc2[nH]nc(-c3nc4cc(ccc4[nH]3)N3CCCCC3)c2c1)c1cccnc1
Show InChI InChI=1S/C25H24N6O/c1-2-11-31(12-3-1)18-6-8-22-23(13-18)28-25(27-22)24-20-14-19(7-9-21(20)29-30-24)32-16-17-5-4-10-26-15-17/h4-10,13-15H,1-3,11-12,16H2,(H,27,28)(H,29,30)
NCI pathway
Reactome pathway
n/an/a 1.70n/an/an/an/an/an/a
East China University of Science& Technology
Curated by ChEMBL
Assay Description
Inhibition of recombinant human FGFR1 using poly (Glu, Tyr) 4:1 as substrate after 60 mins by ELISA
J Med Chem 59: 6690-708 (2016)
BindingDB Entry DOI: 10.7270/Q2474CT3