BDBM50189918 CHEMBL211543::H-Dmt-Aba-Gly-NH-CH2-Bid
SMILES: Cc1cc(O)cc(C)c1C[C@H](N)C(=O)N[C@H]1Cc2ccccc2CN(Cc2nc3ccccc3[nH]2)C1=O
InChI Key: InChIKey=KNVMNIVKKSUNLC-OZXSUGGESA-N
Data: 2 KI  2 IC50
Activity Spreadsheet -- Enzyme Inhibition Constant Data from BindingDB
Found 4 hits for monomerid = 50189918
Trg + Lig
Ki
nM
ΔG°
kcal/mole
IC50
nM
Kd
nM
EC50/IC50
nM
koff
s-1
kon
M-1s-1
pHTemp
°C
Mu-type opioid receptor
(Homo sapiens (Human))
BDBM50189918
(CHEMBL211543 | H-Dmt-Aba-Gly-NH-CH2-Bid)
Show SMILES Cc1cc(O)cc(C)c1C[C@H](N)C(=O)N[C@H]1Cc2ccccc2CN(Cc2nc3ccccc3[nH]2)C1=O
Show InChI InChI=1S/C29H31N5O3/c1-17-11-21(35)12-18(2)22(17)14-23(30)28(36)33-26-13-19-7-3-4-8-20(19)15-34(29(26)37)16-27-31-24-9-5-6-10-25(24)32-27/h3-12,23,26,35H,13-16,30H2,1-2H3,(H,31,32)(H,33,36)/t23-,26-/m0/s1
NCI pathway
Reactome pathway
20n/an/an/an/an/an/an/an/a
Vrije Universiteit Brussels
Curated by ChEMBL
Assay Description
Binding affinity to mu opioid receptor
J Med Chem 49: 3990-3 (2006)
Article DOI: 10.1021/jm0603264
BindingDB Entry DOI: 10.7270/Q2474BPW
Delta-type opioid receptor
(Homo sapiens (Human))
BDBM50189918
(CHEMBL211543 | H-Dmt-Aba-Gly-NH-CH2-Bid)
Show SMILES Cc1cc(O)cc(C)c1C[C@H](N)C(=O)N[C@H]1Cc2ccccc2CN(Cc2nc3ccccc3[nH]2)C1=O
Show InChI InChI=1S/C29H31N5O3/c1-17-11-21(35)12-18(2)22(17)14-23(30)28(36)33-26-13-19-7-3-4-8-20(19)15-34(29(26)37)16-27-31-24-9-5-6-10-25(24)32-27/h3-12,23,26,35H,13-16,30H2,1-2H3,(H,31,32)(H,33,36)/t23-,26-/m0/s1
Reactome pathway
427n/an/an/an/an/an/an/an/a
Vrije Universiteit Brussels
Curated by ChEMBL
Assay Description
Binding affinity to delta opioid receptor
J Med Chem 49: 3990-3 (2006)
Article DOI: 10.1021/jm0603264
BindingDB Entry DOI: 10.7270/Q2474BPW
Delta-type opioid receptor
(MOUSE)
BDBM50189918
(CHEMBL211543 | H-Dmt-Aba-Gly-NH-CH2-Bid)
Show SMILES Cc1cc(O)cc(C)c1C[C@H](N)C(=O)N[C@H]1Cc2ccccc2CN(Cc2nc3ccccc3[nH]2)C1=O
Show InChI InChI=1S/C29H31N5O3/c1-17-11-21(35)12-18(2)22(17)14-23(30)28(36)33-26-13-19-7-3-4-8-20(19)15-34(29(26)37)16-27-31-24-9-5-6-10-25(24)32-27/h3-12,23,26,35H,13-16,30H2,1-2H3,(H,31,32)(H,33,36)/t23-,26-/m0/s1
Reactome pathway
n/an/a 2.70E+3n/an/an/an/an/an/a
Vrije Universiteit Brussels
Curated by ChEMBL
Assay Description
Agonist activity at delta opioid receptor by mouse vas deferens assay
J Med Chem 49: 3990-3 (2006)
Article DOI: 10.1021/jm0603264
BindingDB Entry DOI: 10.7270/Q2474BPW
Mu-type opioid receptor
(GUINEA PIG)
BDBM50189918
(CHEMBL211543 | H-Dmt-Aba-Gly-NH-CH2-Bid)
Show SMILES Cc1cc(O)cc(C)c1C[C@H](N)C(=O)N[C@H]1Cc2ccccc2CN(Cc2nc3ccccc3[nH]2)C1=O
Show InChI InChI=1S/C29H31N5O3/c1-17-11-21(35)12-18(2)22(17)14-23(30)28(36)33-26-13-19-7-3-4-8-20(19)15-34(29(26)37)16-27-31-24-9-5-6-10-25(24)32-27/h3-12,23,26,35H,13-16,30H2,1-2H3,(H,31,32)(H,33,36)/t23-,26-/m0/s1
n/an/a 231n/an/an/an/an/an/a
Vrije Universiteit Brussels
Curated by ChEMBL
Assay Description
Agonist activity at mu opioid receptor by guinea pig ileum assay
J Med Chem 49: 3990-3 (2006)
Article DOI: 10.1021/jm0603264
BindingDB Entry DOI: 10.7270/Q2474BPW