BDBM50190798 3-(((2S,4S)-2-((1H-imidazol-1-yl)methyl)-2-(4-chlorophenethyl)-1,3-dioxolan-4-yl)methylthio)benzenamine hydrochloride::CHEMBL536512
SMILES: Nc1cccc(SC[C@@H]2CO[C@](CCc3ccc(Cl)cc3)(Cn3ccnc3)O2)c1
InChI Key: InChIKey=DQRVOOHZRJYBIQ-UNMCSNQZSA-N
Data: 2 IC50
Activity Spreadsheet -- Enzyme Inhibition Constant Data from BindingDB
Found 2 hits for monomerid = 50190798
Trg + Lig
Ki
nM
ΔG°
kcal/mole
IC50
nM
Kd
nM
EC50/IC50
nM
koff
s-1
kon
M-1s-1
pHTemp
°C
Heme Oxygenase 2 (HO-2)
(Rattus norvegicus (rat))
BDBM50190798
(3-(((2S,4S)-2-((1H-imidazol-1-yl)methyl)-2-(4-chlo...)
Show SMILES Nc1cccc(SC[C@@H]2CO[C@](CCc3ccc(Cl)cc3)(Cn3ccnc3)O2)c1
Show InChI InChI=1S/C22H24ClN3O2S/c23-18-6-4-17(5-7-18)8-9-22(15-26-11-10-25-16-26)27-13-20(28-22)14-29-21-3-1-2-19(24)12-21/h1-7,10-12,16,20H,8-9,13-15,24H2/t20-,22-/m0/s1
Reactome pathway
n/an/a 3.50E+4n/an/an/an/an/an/a
Queen's University
Curated by ChEMBL
Assay Description
Inhibition of Sprague-Dawley rat brain HO2
J Med Chem 49: 4437-41 (2006)
Article DOI: 10.1021/jm0511435
BindingDB Entry DOI: 10.7270/Q2GH9JR1
Heme Oxygenase 1 (HO-1)
(Rattus norvegicus (rat))
BDBM50190798
(3-(((2S,4S)-2-((1H-imidazol-1-yl)methyl)-2-(4-chlo...)
Show SMILES Nc1cccc(SC[C@@H]2CO[C@](CCc3ccc(Cl)cc3)(Cn3ccnc3)O2)c1
Show InChI InChI=1S/C22H24ClN3O2S/c23-18-6-4-17(5-7-18)8-9-22(15-26-11-10-25-16-26)27-13-20(28-22)14-29-21-3-1-2-19(24)12-21/h1-7,10-12,16,20H,8-9,13-15,24H2/t20-,22-/m0/s1
Reactome pathway
n/an/a 1.00E+3n/an/an/an/an/an/a
Queen's University
Curated by ChEMBL
Assay Description
Inhibition of Sprague-Dawley rat spleen HO1
J Med Chem 49: 4437-41 (2006)
Article DOI: 10.1021/jm0511435
BindingDB Entry DOI: 10.7270/Q2GH9JR1