BDBM50191079 2-(((1R,2S,3S)-3-((R)-1-(3,5-bis(trifluoromethyl)phenyl)ethoxy)-2-(4-fluorophenyl)cyclopentyl)(2-methoxyethyl)amino)acetamide::CHEMBL213538
SMILES: COCCN(CC(N)=O)[C@@H]1CC[C@H](O[C@H](C)c2cc(cc(c2)C(F)(F)F)C(F)(F)F)[C@H]1c1ccc(F)cc1
InChI Key: InChIKey=OYLSPKHKOGUFDA-LMIIYESCSA-N
Data: 1 IC50
Activity Spreadsheet -- Enzyme Inhibition Constant Data from BindingDB
Found 1 hit for monomerid = 50191079
Trg + Lig
Ki
nM
ΔG°
kcal/mole
IC50
nM
Kd
nM
EC50/IC50
nM
koff
s-1
kon
M-1s-1
pHTemp
°C
Neurokinin 1 receptor
(Homo sapiens (Human))
BDBM50191079
(2-(((1R,2S,3S)-3-((R)-1-(3,5-bis(trifluoromethyl)p...)
Show SMILES COCCN(CC(N)=O)[C@@H]1CC[C@H](O[C@H](C)c2cc(cc(c2)C(F)(F)F)C(F)(F)F)[C@H]1c1ccc(F)cc1
Show InChI InChI=1S/C26H29F7N2O3/c1-15(17-11-18(25(28,29)30)13-19(12-17)26(31,32)33)38-22-8-7-21(35(9-10-37-2)14-23(34)36)24(22)16-3-5-20(27)6-4-16/h3-6,11-13,15,21-22,24H,7-10,14H2,1-2H3,(H2,34,36)/t15-,21-,22+,24+/m1/s1
Reactome pathway
n/an/a 0.170n/an/an/an/an/an/a
Merck Research Laboratories
Curated by ChEMBL
Assay Description
Displacement of [125I]SP from human cloned NK1 receptor expressed in CHO cells
Bioorg Med Chem Lett 16: 4504-11 (2006)
Article DOI: 10.1016/j.bmcl.2006.06.044
BindingDB Entry DOI: 10.7270/Q20P0ZM5