BDBM50191107 2-(((1R,2S,3S)-3-((R)-1-(3,5-bis(trifluoromethyl)phenyl)ethoxy)-2-(4-fluorophenyl)cyclopentyl)(methyl)amino)-N-methylacetamide::CHEMBL384112
SMILES: CNC(=O)CN(C)[C@@H]1CC[C@H](O[C@H](C)c2cc(cc(c2)C(F)(F)F)C(F)(F)F)[C@H]1c1ccc(F)cc1
InChI Key: InChIKey=UHXQQBRUNHWYBZ-XGXIMLBESA-N
Data: 1 IC50
Activity Spreadsheet -- Enzyme Inhibition Constant Data from BindingDB
Found 1 hit for monomerid = 50191107
Trg + Lig
Ki
nM
ΔG°
kcal/mole
IC50
nM
Kd
nM
EC50/IC50
nM
koff
s-1
kon
M-1s-1
pHTemp
°C
Neurokinin 1 receptor
(Homo sapiens (Human))
BDBM50191107
(2-(((1R,2S,3S)-3-((R)-1-(3,5-bis(trifluoromethyl)p...)
Show SMILES CNC(=O)CN(C)[C@@H]1CC[C@H](O[C@H](C)c2cc(cc(c2)C(F)(F)F)C(F)(F)F)[C@H]1c1ccc(F)cc1
Show InChI InChI=1S/C25H27F7N2O2/c1-14(16-10-17(24(27,28)29)12-18(11-16)25(30,31)32)36-21-9-8-20(34(3)13-22(35)33-2)23(21)15-4-6-19(26)7-5-15/h4-7,10-12,14,20-21,23H,8-9,13H2,1-3H3,(H,33,35)/t14-,20-,21+,23+/m1/s1
Reactome pathway
n/an/a 0.190n/an/an/an/an/an/a
Merck Research Laboratories
Curated by ChEMBL
Assay Description
Displacement of [125I]SP from human cloned NK1 receptor expressed in CHO cells
Bioorg Med Chem Lett 16: 4504-11 (2006)
Article DOI: 10.1016/j.bmcl.2006.06.044
BindingDB Entry DOI: 10.7270/Q20P0ZM5