BDBM50191395 (2'Z,3'E)-1-methyl-7-bromoindirubin-3'-[O-(2-pyrrolidin-1-ylethyl)oxime]::CHEMBL210104
SMILES: Cn1c(O)c(C2=Nc3ccccc3\C2=N/OCCN2CCCC2)c2cccc(Br)c12
InChI Key: InChIKey=LEBAXTFUELGCGQ-LHLOQNFPSA-N
Data: 2 IC50
Activity Spreadsheet -- Enzyme Inhibition Constant Data from BindingDB
Found 2 hits for monomerid = 50191395
Trg + Lig
Ki
nM
ΔG°
kcal/mole
IC50
nM
Kd
nM
EC50/IC50
nM
koff
s-1
kon
M-1s-1
pHTemp
°C
Aryl hydrocarbon receptor
(Homo sapiens (Human))
BDBM50191395
((2'Z,3'E)-1-methyl-7-bromoindirubin-3'-[O-(2-pyrro...)
Show SMILES Cn1c(O)c(C2=Nc3ccccc3\C2=N/OCCN2CCCC2)c2cccc(Br)c12 |t:5|
Show InChI InChI=1S/C23H23BrN4O2/c1-27-22-16(8-6-9-17(22)24)19(23(27)29)21-20(15-7-2-3-10-18(15)25-21)26-30-14-13-28-11-4-5-12-28/h2-3,6-10,29H,4-5,11-14H2,1H3/b26-20+
n/an/a 1.88E+4n/an/an/an/an/an/a
C.N.R.S.
Curated by ChEMBL
Assay Description
Survival of mouse AhR +/+ 5L cells after 48 hrs by MTS reduction assay
J Med Chem 49: 4638-49 (2006)
Article DOI: 10.1021/jm060314i
BindingDB Entry DOI: 10.7270/Q21G0N3Z
Cyclin-dependent kinase 5 activator 1
(Homo sapiens (Human))
BDBM50191395
((2'Z,3'E)-1-methyl-7-bromoindirubin-3'-[O-(2-pyrro...)
Show SMILES Cn1c(O)c(C2=Nc3ccccc3\C2=N/OCCN2CCCC2)c2cccc(Br)c12 |t:5|
Show InChI InChI=1S/C23H23BrN4O2/c1-27-22-16(8-6-9-17(22)24)19(23(27)29)21-20(15-7-2-3-10-18(15)25-21)26-30-14-13-28-11-4-5-12-28/h2-3,6-10,29H,4-5,11-14H2,1H3/b26-20+
NCI pathway
Reactome pathway
n/an/a>1.00E+4n/an/an/an/an/an/a
C.N.R.S.
Curated by ChEMBL
Assay Description
Inhibition of mammalian CDK5/p25
J Med Chem 49: 4638-49 (2006)
Article DOI: 10.1021/jm060314i
BindingDB Entry DOI: 10.7270/Q21G0N3Z