BDBM50191514 2-{4-[2-(4-chlorophenyl)pyridin-3-ylmethoxy]phenyl}-1-cyclohexyl-1H-benzimidazole-5-carboxylic acid::CHEMBL212582
SMILES: OC(=O)c1ccc2n(C3CCCCC3)c(nc2c1)-c1ccc(OCc2cccnc2-c2ccc(Cl)cc2)cc1
InChI Key: InChIKey=WCRPMXRVEWRLMT-UHFFFAOYSA-N
Data: 3 IC50
Activity Spreadsheet -- Enzyme Inhibition Constant Data from BindingDB
Found 3 hits for monomerid = 50191514
Trg + Lig
Ki
nM
ΔG°
kcal/mole
IC50
nM
Kd
nM
EC50/IC50
nM
koff
s-1
kon
M-1s-1
pHTemp
°C
Hepatitis C virus NS5B RNA-dependent RNA polymerase
(Hepatitis C virus)
BDBM50191514
(2-{4-[2-(4-chlorophenyl)pyridin-3-ylmethoxy]phenyl...)
Show SMILES OC(=O)c1ccc2n(C3CCCCC3)c(nc2c1)-c1ccc(OCc2cccnc2-c2ccc(Cl)cc2)cc1
Show InChI InChI=1S/C32H28ClN3O3/c33-25-13-8-21(9-14-25)30-24(5-4-18-34-30)20-39-27-15-10-22(11-16-27)31-35-28-19-23(32(37)38)12-17-29(28)36(31)26-6-2-1-3-7-26/h4-5,8-19,26H,1-3,6-7,20H2,(H,37,38)
n/an/a 53n/an/an/an/an/an/a
Central Pharmaceutical Research Institute
Curated by ChEMBL
Assay Description
Inhibition of HCV 1b BK six His-tagged C-terminal truncated 544 amino acid NS5B RNA dependent RNA polymerase
J Med Chem 49: 4721-36 (2006)
Article DOI: 10.1021/jm060269e
BindingDB Entry DOI: 10.7270/Q2FN15TD
RNA-directed RNA polymerase
(Hepatitis C virus genotype 1)
BDBM50191514
(2-{4-[2-(4-chlorophenyl)pyridin-3-ylmethoxy]phenyl...)
Show SMILES OC(=O)c1ccc2n(C3CCCCC3)c(nc2c1)-c1ccc(OCc2cccnc2-c2ccc(Cl)cc2)cc1
Show InChI InChI=1S/C32H28ClN3O3/c33-25-13-8-21(9-14-25)30-24(5-4-18-34-30)20-39-27-15-10-22(11-16-27)31-35-28-19-23(32(37)38)12-17-29(28)36(31)26-6-2-1-3-7-26/h4-5,8-19,26H,1-3,6-7,20H2,(H,37,38)
n/an/a 53n/an/an/an/an/an/a
TBA
Assay Description
Inhibition of Hepatitis C virus genotype 1 NS5B polymerases lacking C-terminal 47 amino acid residues expressed in Escherichia coli after 60 min
Citation and Details
Article DOI: 10.1007/s00044-012-0186-8
BindingDB Entry DOI: 10.7270/Q2NC6441
RNA-directed RNA polymerase
(Hepatitis C virus genotype 1)
BDBM50191514
(2-{4-[2-(4-chlorophenyl)pyridin-3-ylmethoxy]phenyl...)
Show SMILES OC(=O)c1ccc2n(C3CCCCC3)c(nc2c1)-c1ccc(OCc2cccnc2-c2ccc(Cl)cc2)cc1
Show InChI InChI=1S/C32H28ClN3O3/c33-25-13-8-21(9-14-25)30-24(5-4-18-34-30)20-39-27-15-10-22(11-16-27)31-35-28-19-23(32(37)38)12-17-29(28)36(31)26-6-2-1-3-7-26/h4-5,8-19,26H,1-3,6-7,20H2,(H,37,38)
n/an/a 1.89E+7n/an/an/an/an/an/a
TBA
Assay Description
Inhibition of Hepatitis C virus genotype 1 NS5B polymerases lacking C-terminal 47 amino acid residues expressed in Escherichia coli after 60 min
Citation and Details
Article DOI: 10.1007/s00044-012-0186-8
BindingDB Entry DOI: 10.7270/Q2NC6441