BDBM50191516 2-[4-(4-chloro-4'-methoxybiphenyl-2-ylmethoxy)phenyl]-1-cyclohexyl-1H-benzimidazole-5-carboxylic acid::CHEMBL211649
SMILES: COc1ccc(cc1)-c1ccc(Cl)cc1COc1ccc(cc1)-c1nc2cc(ccc2n1C1CCCCC1)C(O)=O
InChI Key: InChIKey=FJKCDOQEQCBQPZ-UHFFFAOYSA-N
Data: 3 IC50
Activity Spreadsheet -- Enzyme Inhibition Constant Data from BindingDB
Found 3 hits for monomerid = 50191516
Trg + Lig
Ki
nM
ΔG°
kcal/mole
IC50
nM
Kd
nM
EC50/IC50
nM
koff
s-1
kon
M-1s-1
pHTemp
°C
Hepatitis C virus NS5B RNA-dependent RNA polymerase
(Hepatitis C virus)
BDBM50191516
(2-[4-(4-chloro-4'-methoxybiphenyl-2-ylmethoxy)phen...)
Show SMILES COc1ccc(cc1)-c1ccc(Cl)cc1COc1ccc(cc1)-c1nc2cc(ccc2n1C1CCCCC1)C(O)=O
Show InChI InChI=1S/C34H31ClN2O4/c1-40-28-13-7-22(8-14-28)30-17-12-26(35)19-25(30)21-41-29-15-9-23(10-16-29)33-36-31-20-24(34(38)39)11-18-32(31)37(33)27-5-3-2-4-6-27/h7-20,27H,2-6,21H2,1H3,(H,38,39)
n/an/a 100n/an/an/an/an/an/a
Central Pharmaceutical Research Institute
Curated by ChEMBL
Assay Description
Inhibition of HCV 1b BK six His-tagged C-terminal truncated 544 amino acid NS5B RNA dependent RNA polymerase
J Med Chem 49: 4721-36 (2006)
Article DOI: 10.1021/jm060269e
BindingDB Entry DOI: 10.7270/Q2FN15TD
RNA-directed RNA polymerase
(Hepatitis C virus genotype 1)
BDBM50191516
(2-[4-(4-chloro-4'-methoxybiphenyl-2-ylmethoxy)phen...)
Show SMILES COc1ccc(cc1)-c1ccc(Cl)cc1COc1ccc(cc1)-c1nc2cc(ccc2n1C1CCCCC1)C(O)=O
Show InChI InChI=1S/C34H31ClN2O4/c1-40-28-13-7-22(8-14-28)30-17-12-26(35)19-25(30)21-41-29-15-9-23(10-16-29)33-36-31-20-24(34(38)39)11-18-32(31)37(33)27-5-3-2-4-6-27/h7-20,27H,2-6,21H2,1H3,(H,38,39)
n/an/a 1.00E+7n/an/an/an/an/an/a
TBA
Assay Description
Inhibition of Hepatitis C virus genotype 1 NS5B polymerases lacking C-terminal 47 amino acid residues expressed in Escherichia coli after 60 min
Citation and Details
Article DOI: 10.1007/s00044-012-0186-8
BindingDB Entry DOI: 10.7270/Q2NC6441
RNA-directed RNA polymerase
(Hepatitis C virus genotype 1)
BDBM50191516
(2-[4-(4-chloro-4'-methoxybiphenyl-2-ylmethoxy)phen...)
Show SMILES COc1ccc(cc1)-c1ccc(Cl)cc1COc1ccc(cc1)-c1nc2cc(ccc2n1C1CCCCC1)C(O)=O
Show InChI InChI=1S/C34H31ClN2O4/c1-40-28-13-7-22(8-14-28)30-17-12-26(35)19-25(30)21-41-29-15-9-23(10-16-29)33-36-31-20-24(34(38)39)11-18-32(31)37(33)27-5-3-2-4-6-27/h7-20,27H,2-6,21H2,1H3,(H,38,39)
n/an/a 100n/an/an/an/an/an/a
TBA
Assay Description
Inhibition of Hepatitis C virus genotype 1 NS5B polymerases lacking C-terminal 47 amino acid residues expressed in Escherichia coli after 60 min
Citation and Details
Article DOI: 10.1007/s00044-012-0186-8
BindingDB Entry DOI: 10.7270/Q2NC6441