BDBM50191540 2-[4-(4'-chloro-4-dimethylaminobiphenyl-2-ylmethoxy)phenyl]-1-cyclohexyl-1H-benzimidazole-5-carboxylic acid::CHEMBL211213
SMILES: CN(C)c1ccc(c(COc2ccc(cc2)-c2nc3cc(ccc3n2C2CCCCC2)C(O)=O)c1)-c1ccc(Cl)cc1
InChI Key: InChIKey=XUMVNVAISTUOEN-UHFFFAOYSA-N
Data: 3 IC50
Activity Spreadsheet -- Enzyme Inhibition Constant Data from BindingDB
Found 3 hits for monomerid = 50191540
Trg + Lig
Ki
nM
ΔG°
kcal/mole
IC50
nM
Kd
nM
EC50/IC50
nM
koff
s-1
kon
M-1s-1
pHTemp
°C
Hepatitis C virus NS5B RNA-dependent RNA polymerase
(Hepatitis C virus)
BDBM50191540
(2-[4-(4'-chloro-4-dimethylaminobiphenyl-2-ylmethox...)
Show SMILES CN(C)c1ccc(c(COc2ccc(cc2)-c2nc3cc(ccc3n2C2CCCCC2)C(O)=O)c1)-c1ccc(Cl)cc1
Show InChI InChI=1S/C35H34ClN3O3/c1-38(2)29-15-18-31(23-8-13-27(36)14-9-23)26(20-29)22-42-30-16-10-24(11-17-30)34-37-32-21-25(35(40)41)12-19-33(32)39(34)28-6-4-3-5-7-28/h8-21,28H,3-7,22H2,1-2H3,(H,40,41)
n/an/a 63n/an/an/an/an/an/a
Central Pharmaceutical Research Institute
Curated by ChEMBL
Assay Description
Inhibition of HCV 1b BK six His-tagged C-terminal truncated 544 amino acid NS5B RNA dependent RNA polymerase
J Med Chem 49: 4721-36 (2006)
Article DOI: 10.1021/jm060269e
BindingDB Entry DOI: 10.7270/Q2FN15TD
RNA-directed RNA polymerase
(Hepatitis C virus genotype 1)
BDBM50191540
(2-[4-(4'-chloro-4-dimethylaminobiphenyl-2-ylmethox...)
Show SMILES CN(C)c1ccc(c(COc2ccc(cc2)-c2nc3cc(ccc3n2C2CCCCC2)C(O)=O)c1)-c1ccc(Cl)cc1
Show InChI InChI=1S/C35H34ClN3O3/c1-38(2)29-15-18-31(23-8-13-27(36)14-9-23)26(20-29)22-42-30-16-10-24(11-17-30)34-37-32-21-25(35(40)41)12-19-33(32)39(34)28-6-4-3-5-7-28/h8-21,28H,3-7,22H2,1-2H3,(H,40,41)
n/an/a 63n/an/an/an/an/an/a
TBA
Assay Description
Inhibition of Hepatitis C virus genotype 1 NS5B polymerases lacking C-terminal 47 amino acid residues expressed in Escherichia coli after 60 min
Citation and Details
Article DOI: 10.1007/s00044-012-0186-8
BindingDB Entry DOI: 10.7270/Q2NC6441
RNA-directed RNA polymerase
(Hepatitis C virus genotype 1)
BDBM50191540
(2-[4-(4'-chloro-4-dimethylaminobiphenyl-2-ylmethox...)
Show SMILES CN(C)c1ccc(c(COc2ccc(cc2)-c2nc3cc(ccc3n2C2CCCCC2)C(O)=O)c1)-c1ccc(Cl)cc1
Show InChI InChI=1S/C35H34ClN3O3/c1-38(2)29-15-18-31(23-8-13-27(36)14-9-23)26(20-29)22-42-30-16-10-24(11-17-30)34-37-32-21-25(35(40)41)12-19-33(32)39(34)28-6-4-3-5-7-28/h8-21,28H,3-7,22H2,1-2H3,(H,40,41)
n/an/a 1.59E+7n/an/an/an/an/an/a
TBA
Assay Description
Inhibition of Hepatitis C virus genotype 1 NS5B polymerases lacking C-terminal 47 amino acid residues expressed in Escherichia coli after 60 min
Citation and Details
Article DOI: 10.1007/s00044-012-0186-8
BindingDB Entry DOI: 10.7270/Q2NC6441