BDBM50191547 2-[4-(4-chloro-4'-cyanobiphenyl-2-ylmethoxy)phenyl]-1-cyclohexyl-1H-benzimidazole-5-carboxylic acid::CHEMBL209681
SMILES: OC(=O)c1ccc2n(C3CCCCC3)c(nc2c1)-c1ccc(OCc2cc(Cl)ccc2-c2ccc(cc2)C#N)cc1
InChI Key: InChIKey=FQUMRIWAJBYZSF-UHFFFAOYSA-N
Data: 3 IC50
Activity Spreadsheet -- Enzyme Inhibition Constant Data from BindingDB
Found 3 hits for monomerid = 50191547
Trg + Lig
Ki
nM
ΔG°
kcal/mole
IC50
nM
Kd
nM
EC50/IC50
nM
koff
s-1
kon
M-1s-1
pHTemp
°C
Hepatitis C virus NS5B RNA-dependent RNA polymerase
(Hepatitis C virus)
BDBM50191547
(2-[4-(4-chloro-4'-cyanobiphenyl-2-ylmethoxy)phenyl...)
Show SMILES OC(=O)c1ccc2n(C3CCCCC3)c(nc2c1)-c1ccc(OCc2cc(Cl)ccc2-c2ccc(cc2)C#N)cc1
Show InChI InChI=1S/C34H28ClN3O3/c35-27-13-16-30(23-8-6-22(20-36)7-9-23)26(18-27)21-41-29-14-10-24(11-15-29)33-37-31-19-25(34(39)40)12-17-32(31)38(33)28-4-2-1-3-5-28/h6-19,28H,1-5,21H2,(H,39,40)
n/an/a 55n/an/an/an/an/an/a
Central Pharmaceutical Research Institute
Curated by ChEMBL
Assay Description
Inhibition of HCV 1b BK six His-tagged C-terminal truncated 544 amino acid NS5B RNA dependent RNA polymerase
J Med Chem 49: 4721-36 (2006)
Article DOI: 10.1021/jm060269e
BindingDB Entry DOI: 10.7270/Q2FN15TD
RNA-directed RNA polymerase
(Hepatitis C virus genotype 1)
BDBM50191547
(2-[4-(4-chloro-4'-cyanobiphenyl-2-ylmethoxy)phenyl...)
Show SMILES OC(=O)c1ccc2n(C3CCCCC3)c(nc2c1)-c1ccc(OCc2cc(Cl)ccc2-c2ccc(cc2)C#N)cc1
Show InChI InChI=1S/C34H28ClN3O3/c35-27-13-16-30(23-8-6-22(20-36)7-9-23)26(18-27)21-41-29-14-10-24(11-15-29)33-37-31-19-25(34(39)40)12-17-32(31)38(33)28-4-2-1-3-5-28/h6-19,28H,1-5,21H2,(H,39,40)
n/an/a 55n/an/an/an/an/an/a
TBA
Assay Description
Inhibition of Hepatitis C virus genotype 1 NS5B polymerases lacking C-terminal 47 amino acid residues expressed in Escherichia coli after 60 min
Citation and Details
Article DOI: 10.1007/s00044-012-0186-8
BindingDB Entry DOI: 10.7270/Q2NC6441
RNA-directed RNA polymerase
(Hepatitis C virus genotype 1)
BDBM50191547
(2-[4-(4-chloro-4'-cyanobiphenyl-2-ylmethoxy)phenyl...)
Show SMILES OC(=O)c1ccc2n(C3CCCCC3)c(nc2c1)-c1ccc(OCc2cc(Cl)ccc2-c2ccc(cc2)C#N)cc1
Show InChI InChI=1S/C34H28ClN3O3/c35-27-13-16-30(23-8-6-22(20-36)7-9-23)26(18-27)21-41-29-14-10-24(11-15-29)33-37-31-19-25(34(39)40)12-17-32(31)38(33)28-4-2-1-3-5-28/h6-19,28H,1-5,21H2,(H,39,40)
n/an/a 1.82E+7n/an/an/an/an/an/a
TBA
Assay Description
Inhibition of Hepatitis C virus genotype 1 NS5B polymerases lacking C-terminal 47 amino acid residues expressed in Escherichia coli after 60 min
Citation and Details
Article DOI: 10.1007/s00044-012-0186-8
BindingDB Entry DOI: 10.7270/Q2NC6441