BDBM50191679 CHEMBL3902393
SMILES: Clc1cc2c3n(cnc3cnc2cn1)-c1ccc2nc[nH]c2c1
InChI Key: InChIKey=ZDLYEJAFHLYRKG-UHFFFAOYSA-N
Data: 1 IC50
Activity Spreadsheet -- Enzyme Inhibition Constant Data from BindingDB
Found 1 hit for monomerid = 50191679
Trg + Lig
Ki
nM
ΔG°
kcal/mole
IC50
nM
Kd
nM
EC50/IC50
nM
koff
s-1
kon
M-1s-1
pHTemp
°C
Mitogen-activated protein kinase kinase kinase 8
(Homo sapiens (Human))
BDBM50191679
(CHEMBL3902393)
Show SMILES Clc1cc2c3n(cnc3cnc2cn1)-c1ccc2nc[nH]c2c1
Show InChI InChI=1S/C16H9ClN6/c17-15-4-10-13(5-19-15)18-6-14-16(10)23(8-22-14)9-1-2-11-12(3-9)21-7-20-11/h1-8H,(H,20,21)
NCI pathway
Reactome pathway
n/an/a>1.00E+4n/an/an/an/an/an/a
Novartis Institutes for BioMedical Research
Curated by ChEMBL
Assay Description
Inhibition of human COT (66 to 395 residues) expressed in Sf21 cells using 5-Fluo-Ahx-AGAGSGQLIDSNleANSFVGTR-NH2 as substrate after 60 mins by calipe...
J Med Chem 59: 7544-60 (2016)
BindingDB Entry DOI: 10.7270/Q29P33MR