BDBM50191756 4'-fluoro-biphenyl-4-carboxylic acid methyl-(3-piperidin-1-ylmethyl-quinolin-8-ylmethyl)-amide::CHEMBL215321
SMILES: CN(Cc1cccc2cc(CN3CCCCC3)cnc12)C(=O)c1ccc(cc1)-c1ccc(F)cc1
InChI Key: InChIKey=HBTCWVBUPLVVNX-UHFFFAOYSA-N
Data: 1 KI  1 IC50
Activity Spreadsheet -- Enzyme Inhibition Constant Data from BindingDB
Found 2 hits for monomerid = 50191756
Trg + Lig
Ki
nM
ΔG°
kcal/mole
IC50
nM
Kd
nM
EC50/IC50
nM
koff
s-1
kon
M-1s-1
pHTemp
°C
Melanin-concentrating hormone receptor
(Homo sapiens (Human))
BDBM50191756
(4'-fluoro-biphenyl-4-carboxylic acid methyl-(3-pip...)
Show SMILES CN(Cc1cccc2cc(CN3CCCCC3)cnc12)C(=O)c1ccc(cc1)-c1ccc(F)cc1
Show InChI InChI=1S/C30H30FN3O/c1-33(30(35)25-10-8-23(9-11-25)24-12-14-28(31)15-13-24)21-27-7-5-6-26-18-22(19-32-29(26)27)20-34-16-3-2-4-17-34/h5-15,18-19H,2-4,16-17,20-21H2,1H3
Reactome pathway
31n/an/an/an/an/an/an/an/a
Procter and Gamble Pharmaceuticals Inc.
Curated by ChEMBL
Assay Description
Binding affinity to MCHR1 by radioligand binding assay
Bioorg Med Chem Lett 16: 5207-11 (2006)
Article DOI: 10.1016/j.bmcl.2006.07.006
BindingDB Entry DOI: 10.7270/Q2SX6CV3
5-hydroxytryptamine receptor 2C
(Homo sapiens (Human))
BDBM50191756
(4'-fluoro-biphenyl-4-carboxylic acid methyl-(3-pip...)
Show SMILES CN(Cc1cccc2cc(CN3CCCCC3)cnc12)C(=O)c1ccc(cc1)-c1ccc(F)cc1
Show InChI InChI=1S/C30H30FN3O/c1-33(30(35)25-10-8-23(9-11-25)24-12-14-28(31)15-13-24)21-27-7-5-6-26-18-22(19-32-29(26)27)20-34-16-3-2-4-17-34/h5-15,18-19H,2-4,16-17,20-21H2,1H3
Reactome pathway
n/an/a 4.19E+3n/an/an/an/an/an/a
Procter and Gamble Pharmaceuticals Inc.
Curated by ChEMBL
Assay Description
Displacement of [3H]mesulergine from 5HT2C receptor
Bioorg Med Chem Lett 16: 5207-11 (2006)
Article DOI: 10.1016/j.bmcl.2006.07.006
BindingDB Entry DOI: 10.7270/Q2SX6CV3