null
SMILES: Cc1nc2ccc(cc2s1)-n1cnc2cnc3cnc(cc3c12)-c1ccccc1
InChI Key: InChIKey=CJSAGIIAFYMWNG-UHFFFAOYSA-N
Activity Spreadsheet -- Enzyme Inhibition Constant Data from BindingDB
Found 1 hit for monomerid = 50191772
Trg + Lig
Ki
nM
ΔG°
kcal/mole
IC50
nM
Kd
nM
EC50/IC50
nM
koff
s-1
kon
M-1s-1
pHTemp
°C
Mitogen-activated protein kinase kinase kinase 8
(Homo sapiens (Human))
BDBM50191772
(CHEMBL3936462)
Show SMILES Cc1nc2ccc(cc2s1)-n1cnc2cnc3cnc(cc3c12)-c1ccccc1
Show InChI InChI=1S/C23H15N5S/c1-14-27-18-8-7-16(9-22(18)29-14)28-13-26-21-12-25-20-11-24-19(10-17(20)23(21)28)15-5-3-2-4-6-15/h2-13H,1H3
NCI pathway
Reactome pathway
n/an/a 80n/an/an/an/an/an/a
Novartis Institutes for BioMedical Research
Curated by ChEMBL
Assay Description
Inhibition of human COT (66 to 395 residues) expressed in Sf21 cells using 5-Fluo-Ahx-AGAGSGQLIDSNleANSFVGTR-NH2 as substrate after 60 mins by calipe...
J Med Chem 59: 7544-60 (2016)
BindingDB Entry DOI: 10.7270/Q29P33MR