BDBM50192251 CHEMBL3976319
SMILES: Cn1c(SCCCN2CC[C@]3(C[C@@H]3c3ccc(cc3)C(F)(F)F)C2)nnc1-c1cccs1
InChI Key: InChIKey=ZWINHZKEJACBFT-GCJKJVERSA-N
Data: 4 KI  1 IC50
Activity Spreadsheet -- Enzyme Inhibition Constant Data from BindingDB
Found 5 hits for monomerid = 50192251
Trg + Lig
Ki
nM
ΔG°
kcal/mole
IC50
nM
Kd
nM
EC50/IC50
nM
koff
s-1
kon
M-1s-1
pHTemp
°C
D(3) dopamine receptor
(Homo sapiens (Human))
BDBM50192251
(CHEMBL3976319)
Show SMILES Cn1c(SCCCN2CC[C@]3(C[C@@H]3c3ccc(cc3)C(F)(F)F)C2)nnc1-c1cccs1 |r|
Show InChI InChI=1S/C23H25F3N4S2/c1-29-20(19-4-2-12-31-19)27-28-21(29)32-13-3-10-30-11-9-22(15-30)14-18(22)16-5-7-17(8-6-16)23(24,25)26/h2,4-8,12,18H,3,9-11,13-15H2,1H3/t18-,22+/m1/s1
0.537n/an/an/an/an/an/an/an/a
Aptuit s.r.l.
Curated by ChEMBL
Assay Description
Antagonist activity at human dopamine D3 receptor expressed in CHO cell membranes after 90 mins in presence of quinelorane by [35S]-GTPgammaS binding...
J Med Chem 59: 8549-76 (2016)
BindingDB Entry DOI: 10.7270/Q2SQ9298
D(3) dopamine receptor
(Homo sapiens (Human))
BDBM50192251
(CHEMBL3976319)
Show SMILES Cn1c(SCCCN2CC[C@]3(C[C@@H]3c3ccc(cc3)C(F)(F)F)C2)nnc1-c1cccs1 |r|
Show InChI InChI=1S/C23H25F3N4S2/c1-29-20(19-4-2-12-31-19)27-28-21(29)32-13-3-10-30-11-9-22(15-30)14-18(22)16-5-7-17(8-6-16)23(24,25)26/h2,4-8,12,18H,3,9-11,13-15H2,1H3/t18-,22+/m1/s1
0.603n/an/an/an/an/an/an/an/a
Aptuit s.r.l.
Curated by ChEMBL
Assay Description
Displacement of [3H]-spiperone from human dopamine D3 receptor expressed in CHO-K1 cell membranes after 90 mins by liquid scintillation counting
J Med Chem 59: 8549-76 (2016)
BindingDB Entry DOI: 10.7270/Q2SQ9298
D(2) dopamine receptor
(Homo sapiens (Human))
BDBM50192251
(CHEMBL3976319)
Show SMILES Cn1c(SCCCN2CC[C@]3(C[C@@H]3c3ccc(cc3)C(F)(F)F)C2)nnc1-c1cccs1 |r|
Show InChI InChI=1S/C23H25F3N4S2/c1-29-20(19-4-2-12-31-19)27-28-21(29)32-13-3-10-30-11-9-22(15-30)14-18(22)16-5-7-17(8-6-16)23(24,25)26/h2,4-8,12,18H,3,9-11,13-15H2,1H3/t18-,22+/m1/s1
Reactome pathway
162n/an/an/an/an/an/an/an/a
Aptuit s.r.l.
Curated by ChEMBL
Assay Description
Antagonist activity at human dopamine D2L receptor expressed in CHO cells coexpressing Galpha16 assessed as inhibition of dopamine-induced Ca2+ stimu...
J Med Chem 59: 8549-76 (2016)
BindingDB Entry DOI: 10.7270/Q2SQ9298
D(2) dopamine receptor
(Homo sapiens (Human))
BDBM50192251
(CHEMBL3976319)
Show SMILES Cn1c(SCCCN2CC[C@]3(C[C@@H]3c3ccc(cc3)C(F)(F)F)C2)nnc1-c1cccs1 |r|
Show InChI InChI=1S/C23H25F3N4S2/c1-29-20(19-4-2-12-31-19)27-28-21(29)32-13-3-10-30-11-9-22(15-30)14-18(22)16-5-7-17(8-6-16)23(24,25)26/h2,4-8,12,18H,3,9-11,13-15H2,1H3/t18-,22+/m1/s1
Reactome pathway
347n/an/an/an/an/an/an/an/a
Aptuit s.r.l.
Curated by ChEMBL
Assay Description
Displacement of [3H]-spiperone from human dopamine D2 receptor expressed in CHO-K1 cell membranes coexpressing Galpha16 after 120 mins by liquid scin...
J Med Chem 59: 8549-76 (2016)
BindingDB Entry DOI: 10.7270/Q2SQ9298
1,3-beta-glucan synthase component GLS2
(Saccharomyces cerevisiae)
BDBM50192251
(CHEMBL3976319)
Show SMILES Cn1c(SCCCN2CC[C@]3(C[C@@H]3c3ccc(cc3)C(F)(F)F)C2)nnc1-c1cccs1 |r|
Show InChI InChI=1S/C23H25F3N4S2/c1-29-20(19-4-2-12-31-19)27-28-21(29)32-13-3-10-30-11-9-22(15-30)14-18(22)16-5-7-17(8-6-16)23(24,25)26/h2,4-8,12,18H,3,9-11,13-15H2,1H3/t18-,22+/m1/s1
n/an/a>100n/an/an/an/an/an/a
Aptuit s.r.l.
Curated by ChEMBL
Assay Description
Inhibition of human ERG transfected in HEK293 cells assessed as reduction in tail current by patch clamp assay
J Med Chem 59: 8549-76 (2016)
BindingDB Entry DOI: 10.7270/Q2SQ9298