BDBM50192346 4-(3-(aminomethyl)phenyl)-9-hydroxypyrrolo[3,4-c]carbazole-1,3(2H,6H)-dione::4-[3-(aminomethyl)phenyl]-9-hydroxypyrrolo[3,4-c]carbazole-1,3(2H,6H)-dione::CHEMBL385828
SMILES: NCc1cccc(c1)-c1cc2[nH]c3ccc(O)cc3c2c2C(=O)NC(=O)c12
InChI Key: InChIKey=DAXOGPJPUPPMHH-UHFFFAOYSA-N
Data: 3 IC50
Activity Spreadsheet -- Enzyme Inhibition Constant Data from BindingDB
Found 3 hits for monomerid = 50192346
Trg + Lig
Ki
nM
ΔG°
kcal/mole
IC50
nM
Kd
nM
EC50/IC50
nM
koff
s-1
kon
M-1s-1
pHTemp
°C
Serine/threonine-protein kinase Chk1
(Homo sapiens (Human))
BDBM50192346
(4-(3-(aminomethyl)phenyl)-9-hydroxypyrrolo[3,4-c]c...)
Show SMILES NCc1cccc(c1)-c1cc2[nH]c3ccc(O)cc3c2c2C(=O)NC(=O)c12
Show InChI InChI=1S/C21H15N3O3/c22-9-10-2-1-3-11(6-10)13-8-16-17(19-18(13)20(26)24-21(19)27)14-7-12(25)4-5-15(14)23-16/h1-8,23,25H,9,22H2,(H,24,26,27)
Reactome pathway
n/an/a 2.30E+4n/an/an/an/an/an/a
University of Auckland
Curated by ChEMBL
Assay Description
Inhibition at human Chk1 in presence of 4 uM ATP
J Med Chem 49: 4896-911 (2006)
Article DOI: 10.1021/jm0512591
BindingDB Entry DOI: 10.7270/Q23778BD
Serine/threonine-protein kinase WEE1
(Homo sapiens (Human))
BDBM50192346
(4-(3-(aminomethyl)phenyl)-9-hydroxypyrrolo[3,4-c]c...)
Show SMILES NCc1cccc(c1)-c1cc2[nH]c3ccc(O)cc3c2c2C(=O)NC(=O)c12
Show InChI InChI=1S/C21H15N3O3/c22-9-10-2-1-3-11(6-10)13-8-16-17(19-18(13)20(26)24-21(19)27)14-7-12(25)4-5-15(14)23-16/h1-8,23,25H,9,22H2,(H,24,26,27)
NCI pathway
Reactome pathway
n/an/a 4.47E+3n/an/an/an/an/an/a
Chulalongkorn University
Curated by ChEMBL
Assay Description
Inhibition of human Wee1
Eur J Med Chem 44: 1383-95 (2009)
Article DOI: 10.1016/j.ejmech.2008.09.027
BindingDB Entry DOI: 10.7270/Q2X34XB6
3D
3D Structure (docked)
Serine/threonine-protein kinase WEE1
(Homo sapiens (Human))
BDBM50192346
(4-(3-(aminomethyl)phenyl)-9-hydroxypyrrolo[3,4-c]c...)
Show SMILES NCc1cccc(c1)-c1cc2[nH]c3ccc(O)cc3c2c2C(=O)NC(=O)c12
Show InChI InChI=1S/C21H15N3O3/c22-9-10-2-1-3-11(6-10)13-8-16-17(19-18(13)20(26)24-21(19)27)14-7-12(25)4-5-15(14)23-16/h1-8,23,25H,9,22H2,(H,24,26,27)
NCI pathway
Reactome pathway
n/an/a 4.40E+3n/an/an/an/an/an/a
University of Auckland
Curated by ChEMBL
Assay Description
Inhibition of human Wee1 in presence of 9.5 uM ATP
J Med Chem 49: 4896-911 (2006)
Article DOI: 10.1021/jm0512591
BindingDB Entry DOI: 10.7270/Q23778BD
3D
3D Structure (docked)