BDBM50192351 3-(9-hydroxy-1,3-dioxo-1,2,3,6-tetrahydropyrrolo[3,4-c]carbazol-4-yl)benzonitrile::CHEMBL413579
SMILES: Oc1ccc2[nH]c3cc(c4C(=O)NC(=O)c4c3c2c1)-c1cccc(c1)C#N
InChI Key: InChIKey=CPKILSRDHXNBBP-UHFFFAOYSA-N
Data: 3 IC50
Activity Spreadsheet -- Enzyme Inhibition Constant Data from BindingDB
Found 3 hits for monomerid = 50192351
Trg + Lig
Ki
nM
ΔG°
kcal/mole
IC50
nM
Kd
nM
EC50/IC50
nM
koff
s-1
kon
M-1s-1
pHTemp
°C
Serine/threonine-protein kinase Chk1
(Homo sapiens (Human))
BDBM50192351
(3-(9-hydroxy-1,3-dioxo-1,2,3,6-tetrahydropyrrolo[3...)
Show SMILES Oc1ccc2[nH]c3cc(c4C(=O)NC(=O)c4c3c2c1)-c1cccc(c1)C#N
Show InChI InChI=1S/C21H11N3O3/c22-9-10-2-1-3-11(6-10)13-8-16-17(19-18(13)20(26)24-21(19)27)14-7-12(25)4-5-15(14)23-16/h1-8,23,25H,(H,24,26,27)
Reactome pathway
n/an/a 4.20E+3n/an/an/an/an/an/a
University of Auckland
Curated by ChEMBL
Assay Description
Inhibition at human Chk1 in presence of 4 uM ATP
J Med Chem 49: 4896-911 (2006)
Article DOI: 10.1021/jm0512591
BindingDB Entry DOI: 10.7270/Q23778BD
Serine/threonine-protein kinase WEE1
(Homo sapiens (Human))
BDBM50192351
(3-(9-hydroxy-1,3-dioxo-1,2,3,6-tetrahydropyrrolo[3...)
Show SMILES Oc1ccc2[nH]c3cc(c4C(=O)NC(=O)c4c3c2c1)-c1cccc(c1)C#N
Show InChI InChI=1S/C21H11N3O3/c22-9-10-2-1-3-11(6-10)13-8-16-17(19-18(13)20(26)24-21(19)27)14-7-12(25)4-5-15(14)23-16/h1-8,23,25H,(H,24,26,27)
NCI pathway
Reactome pathway
n/an/a 180n/an/an/an/an/an/a
Chulalongkorn University
Curated by ChEMBL
Assay Description
Inhibition of human Wee1
Eur J Med Chem 44: 1383-95 (2009)
Article DOI: 10.1016/j.ejmech.2008.09.027
BindingDB Entry DOI: 10.7270/Q2X34XB6
Serine/threonine-protein kinase WEE1
(Homo sapiens (Human))
BDBM50192351
(3-(9-hydroxy-1,3-dioxo-1,2,3,6-tetrahydropyrrolo[3...)
Show SMILES Oc1ccc2[nH]c3cc(c4C(=O)NC(=O)c4c3c2c1)-c1cccc(c1)C#N
Show InChI InChI=1S/C21H11N3O3/c22-9-10-2-1-3-11(6-10)13-8-16-17(19-18(13)20(26)24-21(19)27)14-7-12(25)4-5-15(14)23-16/h1-8,23,25H,(H,24,26,27)
NCI pathway
Reactome pathway
n/an/a 180n/an/an/an/an/an/a
University of Auckland
Curated by ChEMBL
Assay Description
Inhibition of human Wee1 in presence of 9.5 uM ATP
J Med Chem 49: 4896-911 (2006)
Article DOI: 10.1021/jm0512591
BindingDB Entry DOI: 10.7270/Q23778BD