BDBM50192375 4-(4-fluorophenyl)-9-hydroxypyrrolo[3,4-c]carbazole-1,3(2H,6H)-dione::CHEMBL212798
SMILES: Oc1ccc2[nH]c3cc(c4C(=O)NC(=O)c4c3c2c1)-c1ccc(F)cc1
InChI Key: InChIKey=PCHCQHGYUZFYNG-UHFFFAOYSA-N
Data: 3 IC50
Activity Spreadsheet -- Enzyme Inhibition Constant Data from BindingDB
Found 3 hits for monomerid = 50192375
Trg + Lig
Ki
nM
ΔG°
kcal/mole
IC50
nM
Kd
nM
EC50/IC50
nM
koff
s-1
kon
M-1s-1
pHTemp
°C
Serine/threonine-protein kinase Chk1
(Homo sapiens (Human))
BDBM50192375
(4-(4-fluorophenyl)-9-hydroxypyrrolo[3,4-c]carbazol...)
Show SMILES Oc1ccc2[nH]c3cc(c4C(=O)NC(=O)c4c3c2c1)-c1ccc(F)cc1
Show InChI InChI=1S/C20H11FN2O3/c21-10-3-1-9(2-4-10)12-8-15-16(18-17(12)19(25)23-20(18)26)13-7-11(24)5-6-14(13)22-15/h1-8,22,24H,(H,23,25,26)
Reactome pathway
n/an/a 2.80E+3n/an/an/an/an/an/a
University of Auckland
Curated by ChEMBL
Assay Description
Inhibition at human Chk1 in presence of 4 uM ATP
J Med Chem 49: 4896-911 (2006)
Article DOI: 10.1021/jm0512591
BindingDB Entry DOI: 10.7270/Q23778BD
Serine/threonine-protein kinase WEE1
(Homo sapiens (Human))
BDBM50192375
(4-(4-fluorophenyl)-9-hydroxypyrrolo[3,4-c]carbazol...)
Show SMILES Oc1ccc2[nH]c3cc(c4C(=O)NC(=O)c4c3c2c1)-c1ccc(F)cc1
Show InChI InChI=1S/C20H11FN2O3/c21-10-3-1-9(2-4-10)12-8-15-16(18-17(12)19(25)23-20(18)26)13-7-11(24)5-6-14(13)22-15/h1-8,22,24H,(H,23,25,26)
NCI pathway
Reactome pathway
n/an/a 1.60E+4n/an/an/an/an/an/a
Chulalongkorn University
Curated by ChEMBL
Assay Description
Inhibition of human Wee1
Eur J Med Chem 44: 1383-95 (2009)
Article DOI: 10.1016/j.ejmech.2008.09.027
BindingDB Entry DOI: 10.7270/Q2X34XB6
3D
3D Structure (docked)
Serine/threonine-protein kinase WEE1
(Homo sapiens (Human))
BDBM50192375
(4-(4-fluorophenyl)-9-hydroxypyrrolo[3,4-c]carbazol...)
Show SMILES Oc1ccc2[nH]c3cc(c4C(=O)NC(=O)c4c3c2c1)-c1ccc(F)cc1
Show InChI InChI=1S/C20H11FN2O3/c21-10-3-1-9(2-4-10)12-8-15-16(18-17(12)19(25)23-20(18)26)13-7-11(24)5-6-14(13)22-15/h1-8,22,24H,(H,23,25,26)
NCI pathway
Reactome pathway
n/an/a 1.60E+4n/an/an/an/an/an/a
University of Auckland
Curated by ChEMBL
Assay Description
Inhibition of human Wee1 in presence of 9.5 uM ATP
J Med Chem 49: 4896-911 (2006)
Article DOI: 10.1021/jm0512591
BindingDB Entry DOI: 10.7270/Q23778BD
3D
3D Structure (docked)