BDBM50192637 3-((1R,4R,6R)-4-((5,6-dichloro-1H-benzo[d]imidazol-2-yl)(3-(4-methylpiperazin-1-yl)propyl)amino)bicyclo[4.1.0]heptan-1-yl)benzonitrile::CHEMBL215030
SMILES: CN1CCN(CCCN([C@@H]2CC[C@@]3(C[C@@H]3C2)c2cccc(c2)C#N)c2nc3cc(Cl)c(Cl)cc3[nH]2)CC1
InChI Key: InChIKey=XACSERVYMUAAIG-QFWOEDSFSA-N
Data: 1 KI  1 IC50
Activity Spreadsheet -- Enzyme Inhibition Constant Data from BindingDB
Found 2 hits for monomerid = 50192637
Trg + Lig
Ki
nM
ΔG°
kcal/mole
IC50
nM
Kd
nM
EC50/IC50
nM
koff
s-1
kon
M-1s-1
pHTemp
°C
Melanin-concentrating hormone receptor
(Homo sapiens (Human))
BDBM50192637
(3-((1R,4R,6R)-4-((5,6-dichloro-1H-benzo[d]imidazol...)
Show SMILES CN1CCN(CCCN([C@@H]2CC[C@@]3(C[C@@H]3C2)c2cccc(c2)C#N)c2nc3cc(Cl)c(Cl)cc3[nH]2)CC1
Show InChI InChI=1S/C29H34Cl2N6/c1-35-10-12-36(13-11-35)8-3-9-37(28-33-26-16-24(30)25(31)17-27(26)34-28)23-6-7-29(18-22(29)15-23)21-5-2-4-20(14-21)19-32/h2,4-5,14,16-17,22-23H,3,6-13,15,18H2,1H3,(H,33,34)/t22-,23+,29+/m0/s1
Reactome pathway
2.20n/an/an/an/an/an/an/an/a
Schering-Plough Research Institute
Curated by ChEMBL
Assay Description
Binding activity against human MCH-R1
Bioorg Med Chem Lett 16: 5427-31 (2006)
Article DOI: 10.1016/j.bmcl.2006.07.058
BindingDB Entry DOI: 10.7270/Q228076K
Melanin-concentrating hormone receptor
(Homo sapiens (Human))
BDBM50192637
(3-((1R,4R,6R)-4-((5,6-dichloro-1H-benzo[d]imidazol...)
Show SMILES CN1CCN(CCCN([C@@H]2CC[C@@]3(C[C@@H]3C2)c2cccc(c2)C#N)c2nc3cc(Cl)c(Cl)cc3[nH]2)CC1
Show InChI InChI=1S/C29H34Cl2N6/c1-35-10-12-36(13-11-35)8-3-9-37(28-33-26-16-24(30)25(31)17-27(26)34-28)23-6-7-29(18-22(29)15-23)21-5-2-4-20(14-21)19-32/h2,4-5,14,16-17,22-23H,3,6-13,15,18H2,1H3,(H,33,34)/t22-,23+,29+/m0/s1
Reactome pathway
n/an/a 2.20n/an/an/an/an/an/a
University of Science and Technology
Curated by ChEMBL
Assay Description
Antagonist activity at MCHR1 (unknown origin) expressed in CHO cells co-expressing aequorin incubated for 10 mins by luminescence assay
Bioorg Med Chem Lett 29: (2019)
Article DOI: 10.1016/j.bmcl.2019.126741