null
SMILES: OCCC1(CC(=NN1C(=O)Nc1ccc(F)cc1)c1ccccc1)c1ccccc1
InChI Key: InChIKey=VJJOJVPAQRYRQP-UHFFFAOYSA-N
Activity Spreadsheet -- Enzyme Inhibition Constant Data from BindingDB
Found 2 hits for monomerid = 50192655
Trg + Lig
Ki
nM
ΔG°
kcal/mole
IC50
nM
Kd
nM
EC50/IC50
nM
koff
s-1
kon
M-1s-1
pHTemp
°C
Voltage-dependent T-type calcium channel subunit alpha-1H
(Homo sapiens (Human))
BDBM50192655
(CHEMBL3946972)
Show SMILES OCCC1(CC(=NN1C(=O)Nc1ccc(F)cc1)c1ccccc1)c1ccccc1 |c:5|
Show InChI InChI=1S/C24H22FN3O2/c25-20-11-13-21(14-12-20)26-23(30)28-24(15-16-29,19-9-5-2-6-10-19)17-22(27-28)18-7-3-1-4-8-18/h1-14,29H,15-17H2,(H,26,30)
n/an/a 120n/an/an/an/an/an/a
Actelion Pharmaceuticals Ltd.
Curated by ChEMBL
Assay Description
Inhibition of human T-type calcium channel Cav3.2 expressed in CHO cells assessed as inhibition of calcium tail current at -90 mV holding potential m...
J Med Chem 59: 8398-411 (2016)
BindingDB Entry DOI: 10.7270/Q2J67JWK
Voltage-dependent L-type calcium channel subunit alpha-1C
(Homo sapiens (Human))
BDBM50192655
(CHEMBL3946972)
Show SMILES OCCC1(CC(=NN1C(=O)Nc1ccc(F)cc1)c1ccccc1)c1ccccc1 |c:5|
Show InChI InChI=1S/C24H22FN3O2/c25-20-11-13-21(14-12-20)26-23(30)28-24(15-16-29,19-9-5-2-6-10-19)17-22(27-28)18-7-3-1-4-8-18/h1-14,29H,15-17H2,(H,26,30)
n/an/a 1.94E+3n/an/an/an/an/an/a
Actelion Pharmaceuticals Ltd.
Curated by ChEMBL
Assay Description
Inhibition of recombinant T-type calcium channel Cav1.2 (unknown origin) expressed in HEK293 cells assessed as inhibition of Kcl-induced calcium infl...
J Med Chem 59: 8398-411 (2016)
BindingDB Entry DOI: 10.7270/Q2J67JWK