BDBM50192699 CHEMBL3942685
SMILES: Fc1ccc(cc1)C1CC(=NN1C(=O)NC1CCCCC1)c1ccc(Br)cc1
InChI Key: InChIKey=RGXXKRREVVUYBC-UHFFFAOYSA-N
Data: 2 IC50
Activity Spreadsheet -- Enzyme Inhibition Constant Data from BindingDB
Found 2 hits for monomerid = 50192699
Trg + Lig
Ki
nM
ΔG°
kcal/mole
IC50
nM
Kd
nM
EC50/IC50
nM
koff
s-1
kon
M-1s-1
pHTemp
°C
Voltage-gated calcium channel
(Homo sapiens (Human))
BDBM50192699
(CHEMBL3942685)
Show SMILES Fc1ccc(cc1)C1CC(=NN1C(=O)NC1CCCCC1)c1ccc(Br)cc1 |c:10|
Show InChI InChI=1S/C22H23BrFN3O/c23-17-10-6-15(7-11-17)20-14-21(16-8-12-18(24)13-9-16)27(26-20)22(28)25-19-4-2-1-3-5-19/h6-13,19,21H,1-5,14H2,(H,25,28)
n/an/a 1.34E+3n/an/an/an/an/an/a
Actelion Pharmaceuticals Ltd.
Curated by ChEMBL
Assay Description
Inhibition of recombinant T-type calcium channel Cav1.2 (unknown origin) expressed in HEK293 cells assessed as inhibition of Kcl-induced calcium infl...
J Med Chem 59: 8398-411 (2016)
BindingDB Entry DOI: 10.7270/Q2J67JWK
Voltage-dependent T-type calcium channel subunit alpha-1H
(Homo sapiens (Human))
BDBM50192699
(CHEMBL3942685)
Show SMILES Fc1ccc(cc1)C1CC(=NN1C(=O)NC1CCCCC1)c1ccc(Br)cc1 |c:10|
Show InChI InChI=1S/C22H23BrFN3O/c23-17-10-6-15(7-11-17)20-14-21(16-8-12-18(24)13-9-16)27(26-20)22(28)25-19-4-2-1-3-5-19/h6-13,19,21H,1-5,14H2,(H,25,28)
n/an/a 316n/an/an/an/an/an/a
Actelion Pharmaceuticals Ltd.
Curated by ChEMBL
Assay Description
Inhibition of recombinant T-type calcium channel Cav3.2 (unknown origin) expressed in HEK293 cells assessed as inhibition of CaCl2-induced calcium in...
J Med Chem 59: 8398-411 (2016)
BindingDB Entry DOI: 10.7270/Q2J67JWK