BDBM50192827 CHEMBL3985405
SMILES: CCNC(=O)O[C@@H]1C[C@@H]2CC[C@H](C1)N2C(=O)c1ccc(Nc2nc(cs2)-c2sc(C)nc2C)nc1
InChI Key: InChIKey=FYFOVPOQZWHSNG-PIIMJCKOSA-N
Data: 1 IC50
Activity Spreadsheet -- Enzyme Inhibition Constant Data from BindingDB
Found 1 hit for monomerid = 50192827
Trg + Lig
Ki
nM
ΔG°
kcal/mole
IC50
nM
Kd
nM
EC50/IC50
nM
koff
s-1
kon
M-1s-1
pHTemp
°C
Transient receptor potential cation channel subfamily V member 4
(Homo sapiens (Human))
BDBM50192827
(CHEMBL3985405)
Show SMILES CCNC(=O)O[C@@H]1C[C@@H]2CC[C@H](C1)N2C(=O)c1ccc(Nc2nc(cs2)-c2sc(C)nc2C)nc1 |r|
Show InChI InChI=1S/C24H28N6O3S2/c1-4-25-24(32)33-18-9-16-6-7-17(10-18)30(16)22(31)15-5-8-20(26-11-15)29-23-28-19(12-34-23)21-13(2)27-14(3)35-21/h5,8,11-12,16-18H,4,6-7,9-10H2,1-3H3,(H,25,32)(H,26,28,29)/t16-,17+,18+
n/an/a 1.90n/an/an/an/an/an/a
Shionogi& Co., Ltd
Curated by ChEMBL
Assay Description
Antagonist activity at human TRPV4 assessed as inhibition of 4alpha-PDD-induced activation
Bioorg Med Chem Lett 26: 4936-4941 (2016)
Article DOI: 10.1016/j.bmcl.2016.09.014
BindingDB Entry DOI: 10.7270/Q2154K06