BDBM50192851 CHEMBL3358972
SMILES: CCOc1ccc(cc1OC)-c1nc(c[nH]c1=O)-c1c[nH]c2ccccc12
InChI Key: InChIKey=GXFBYIMHHCRKIV-UHFFFAOYSA-N
Data: 1 IC50
Activity Spreadsheet -- Enzyme Inhibition Constant Data from BindingDB
Found 1 hit for monomerid = 50192851
Trg + Lig
Ki
nM
ΔG°
kcal/mole
IC50
nM
Kd
nM
EC50/IC50
nM
koff
s-1
kon
M-1s-1
pHTemp
°C
Platelet-derived growth factor receptor beta
(Homo sapiens (Human))
BDBM50192851
(CHEMBL3358972)
Show SMILES CCOc1ccc(cc1OC)-c1nc(c[nH]c1=O)-c1c[nH]c2ccccc12
Show InChI InChI=1S/C21H19N3O3/c1-3-27-18-9-8-13(10-19(18)26-2)20-21(25)23-12-17(24-20)15-11-22-16-7-5-4-6-14(15)16/h4-12,22H,3H2,1-2H3,(H,23,25)
NCI pathway
Reactome pathway
n/an/a 5.00E+3n/an/an/an/an/an/a
Christian-Albrechts-University of Kiel
Curated by ChEMBL
Assay Description
Inhibition of human recombinant PDGFRbeta using poly(Ala,Glu,Lys,Tyr) substrate
J Med Chem 58: 170-82 (2015)
Article DOI: 10.1021/jm500373x
BindingDB Entry DOI: 10.7270/Q2ZG6V0R