BDBM50193240 CHEMBL426333::{(R)-1-[2-(4-carbamimidoyl-benzylcarbamoyl)-indan-2-ylcarbamoyl]-2-methyl-propylamino}-acetic acid
SMILES: CC(C)[C@@H](NCC(O)=O)C(=O)NC1(Cc2ccccc2C1)C(=O)NCc1ccc(cc1)C(N)=N
InChI Key: InChIKey=DMLHWKHAUAYLLT-OAQYLSRUSA-N
Data: 2 IC50
Activity Spreadsheet -- Enzyme Inhibition Constant Data from BindingDB
Found 2 hits for monomerid = 50193240
Trg + Lig
Ki
nM
ΔG°
kcal/mole
IC50
nM
Kd
nM
EC50/IC50
nM
koff
s-1
kon
M-1s-1
pHTemp
°C
Vitamin K-dependent protein C
(Homo sapiens (Human))
BDBM50193240
(CHEMBL426333 | {(R)-1-[2-(4-carbamimidoyl-benzylca...)
Show SMILES CC(C)[C@@H](NCC(O)=O)C(=O)NC1(Cc2ccccc2C1)C(=O)NCc1ccc(cc1)C(N)=N
Show InChI InChI=1S/C25H31N5O4/c1-15(2)21(28-14-20(31)32)23(33)30-25(11-18-5-3-4-6-19(18)12-25)24(34)29-13-16-7-9-17(10-8-16)22(26)27/h3-10,15,21,28H,11-14H2,1-2H3,(H3,26,27)(H,29,34)(H,30,33)(H,31,32)/t21-/m1/s1
Reactome pathway
n/an/a 800n/an/an/an/an/an/a
Institut de Recherches Servier
Curated by ChEMBL
Assay Description
Inhibition of human aPC
J Med Chem 49: 5047-50 (2006)
Article DOI: 10.1021/jm0606950
BindingDB Entry DOI: 10.7270/Q2H994VN
Prothrombin
(Homo sapiens (Human))
BDBM50193240
(CHEMBL426333 | {(R)-1-[2-(4-carbamimidoyl-benzylca...)
Show SMILES CC(C)[C@@H](NCC(O)=O)C(=O)NC1(Cc2ccccc2C1)C(=O)NCc1ccc(cc1)C(N)=N
Show InChI InChI=1S/C25H31N5O4/c1-15(2)21(28-14-20(31)32)23(33)30-25(11-18-5-3-4-6-19(18)12-25)24(34)29-13-16-7-9-17(10-8-16)22(26)27/h3-10,15,21,28H,11-14H2,1-2H3,(H3,26,27)(H,29,34)(H,30,33)(H,31,32)/t21-/m1/s1
n/an/a>3.00E+5n/an/an/an/an/an/a
Institut de Recherches Servier
Curated by ChEMBL
Assay Description
Inhibition of human thrombin activity
J Med Chem 49: 5047-50 (2006)
Article DOI: 10.1021/jm0606950
BindingDB Entry DOI: 10.7270/Q2H994VN