BDBM50193266 CHEMBL3940124
SMILES: Cl.CN(C)CCOc1ccc(cc1)C(=C(\CCCO)c1ccccc1)\c1ccc(Cl)cc1
InChI Key: InChIKey=DUIOSFRIDVXCMO-JTHROIFXSA-N
Data: 1 IC50
Activity Spreadsheet -- Enzyme Inhibition Constant Data from BindingDB
Found 1 hit for monomerid = 50193266
Trg + Lig
Ki
nM
ΔG°
kcal/mole
IC50
nM
Kd
nM
EC50/IC50
nM
koff
s-1
kon
M-1s-1
pHTemp
°C
Estrogen-related receptor gamma
(Homo sapiens (Human))
BDBM50193266
(CHEMBL3940124)
Show SMILES Cl.CN(C)CCOc1ccc(cc1)C(=C(\CCCO)c1ccccc1)\c1ccc(Cl)cc1
Show InChI InChI=1S/C27H30ClNO2.ClH/c1-29(2)18-20-31-25-16-12-23(13-17-25)27(22-10-14-24(28)15-11-22)26(9-6-19-30)21-7-4-3-5-8-21;/h3-5,7-8,10-17,30H,6,9,18-20H2,1-2H3;1H/b27-26-;
Reactome pathway
n/an/a 520n/an/an/an/an/an/a
Daegu-Gyeongbuk Medical Innovation Foundation
Curated by ChEMBL
Assay Description
Inhibition of fluorescien-conjugated coactivator PGC1a binding to GST-tagged human ERRgamma LBD after 1 hr by TR-FRET assay
Eur J Med Chem 120: 338-52 (2016)
Article DOI: 10.1016/j.ejmech.2016.04.076
BindingDB Entry DOI: 10.7270/Q2TH8PN2