BDBM50193317 (Z)-3-(4-pyridin-2-ylpiperazin-1-yl)-1-(m-tolyl)propan-1-one O-methyloxime::CHEMBL212903
SMILES: CO\N=C(\CCN1CCN(CC1)c1ccccn1)c1cccc(C)c1
InChI Key: InChIKey=JGJKGZVAKNHAAR-QOCHGBHMSA-N
Data: 2 KI  1 IC50  2 EC50
Activity Spreadsheet -- Enzyme Inhibition Constant Data from BindingDB
Found 5 hits for monomerid = 50193317
Trg + Lig
Ki
nM
ΔG°
kcal/mole
IC50
nM
Kd
nM
EC50/IC50
nM
koff
s-1
kon
M-1s-1
pHTemp
°C
D(4) dopamine receptor
(Homo sapiens (Human))
BDBM50193317
((Z)-3-(4-pyridin-2-ylpiperazin-1-yl)-1-(m-tolyl)pr...)
Show SMILES CO\N=C(\CCN1CCN(CC1)c1ccccn1)c1cccc(C)c1
Show InChI InChI=1S/C20H26N4O/c1-17-6-5-7-18(16-17)19(22-25-2)9-11-23-12-14-24(15-13-23)20-8-3-4-10-21-20/h3-8,10,16H,9,11-15H2,1-2H3/b22-19-
Reactome pathway
32.1n/an/an/an/an/an/an/an/a
Abbott Laboratories
Curated by ChEMBL
Assay Description
Displacement of [3H]A-369508 from human recombinant D4.4 receptor expressed in HEK293 cell membrane
J Med Chem 49: 5093-109 (2006)
Article DOI: 10.1021/jm060279f
BindingDB Entry DOI: 10.7270/Q2CJ8D4B
D(2) dopamine receptor
(Homo sapiens (Human))
BDBM50193317
((Z)-3-(4-pyridin-2-ylpiperazin-1-yl)-1-(m-tolyl)pr...)
Show SMILES CO\N=C(\CCN1CCN(CC1)c1ccccn1)c1cccc(C)c1
Show InChI InChI=1S/C20H26N4O/c1-17-6-5-7-18(16-17)19(22-25-2)9-11-23-12-14-24(15-13-23)20-8-3-4-10-21-20/h3-8,10,16H,9,11-15H2,1-2H3/b22-19-
Reactome pathway
68n/an/an/an/an/an/an/an/a
Abbott Laboratories
Curated by ChEMBL
Assay Description
Displacement of [3H]PIPAT from human recombinant D2L receptor expressed in HEK293 cells
J Med Chem 49: 5093-109 (2006)
Article DOI: 10.1021/jm060279f
BindingDB Entry DOI: 10.7270/Q2CJ8D4B
D(2) dopamine receptor
(Homo sapiens (Human))
BDBM50193317
((Z)-3-(4-pyridin-2-ylpiperazin-1-yl)-1-(m-tolyl)pr...)
Show SMILES CO\N=C(\CCN1CCN(CC1)c1ccccn1)c1cccc(C)c1
Show InChI InChI=1S/C20H26N4O/c1-17-6-5-7-18(16-17)19(22-25-2)9-11-23-12-14-24(15-13-23)20-8-3-4-10-21-20/h3-8,10,16H,9,11-15H2,1-2H3/b22-19-
Reactome pathway
n/an/a>1.00E+4n/an/an/an/an/an/a
Abbott Laboratories
Curated by ChEMBL
Assay Description
Antagonist activity at human recombinant D2 receptor expressed in HEK293 cells by FLIPR assay
J Med Chem 49: 5093-109 (2006)
Article DOI: 10.1021/jm060279f
BindingDB Entry DOI: 10.7270/Q2CJ8D4B
D(4) dopamine receptor
(Homo sapiens (Human))
BDBM50193317
((Z)-3-(4-pyridin-2-ylpiperazin-1-yl)-1-(m-tolyl)pr...)
Show SMILES CO\N=C(\CCN1CCN(CC1)c1ccccn1)c1cccc(C)c1
Show InChI InChI=1S/C20H26N4O/c1-17-6-5-7-18(16-17)19(22-25-2)9-11-23-12-14-24(15-13-23)20-8-3-4-10-21-20/h3-8,10,16H,9,11-15H2,1-2H3/b22-19-
Reactome pathway
n/an/an/an/a 61n/an/an/an/a
Abbott Laboratories
Curated by ChEMBL
Assay Description
Activity at human recombinant D4.4 receptor expressed in HEK293 cells by FLIPR assay
J Med Chem 49: 5093-109 (2006)
Article DOI: 10.1021/jm060279f
BindingDB Entry DOI: 10.7270/Q2CJ8D4B
D(2) dopamine receptor
(Homo sapiens (Human))
BDBM50193317
((Z)-3-(4-pyridin-2-ylpiperazin-1-yl)-1-(m-tolyl)pr...)
Show SMILES CO\N=C(\CCN1CCN(CC1)c1ccccn1)c1cccc(C)c1
Show InChI InChI=1S/C20H26N4O/c1-17-6-5-7-18(16-17)19(22-25-2)9-11-23-12-14-24(15-13-23)20-8-3-4-10-21-20/h3-8,10,16H,9,11-15H2,1-2H3/b22-19-
Reactome pathway
n/an/an/an/a>1.00E+4n/an/an/an/a
Abbott Laboratories
Curated by ChEMBL
Assay Description
Agonist activity at human recombinant D2 receptor expressed in HEK293 cells by FLIPR assay
J Med Chem 49: 5093-109 (2006)
Article DOI: 10.1021/jm060279f
BindingDB Entry DOI: 10.7270/Q2CJ8D4B