BDBM50193334 (Z)-1-(4-fluorophenyl)-3-(4-pyridin-2-ylpiperazin-1-yl)propan-1-one O-methyloxime::CHEMBL427048
SMILES: CO\N=C(\CCN1CCN(CC1)c1ccccn1)c1ccc(F)cc1
InChI Key: InChIKey=BJBRHHUYMNBENN-PYCFMQQDSA-N
Data: 2 KI  1 IC50  2 EC50
Activity Spreadsheet -- Enzyme Inhibition Constant Data from BindingDB
Found 5 hits for monomerid = 50193334
Trg + Lig
Ki
nM
ΔG°
kcal/mole
IC50
nM
Kd
nM
EC50/IC50
nM
koff
s-1
kon
M-1s-1
pHTemp
°C
D(4) dopamine receptor
(Homo sapiens (Human))
BDBM50193334
((Z)-1-(4-fluorophenyl)-3-(4-pyridin-2-ylpiperazin-...)
Show SMILES CO\N=C(\CCN1CCN(CC1)c1ccccn1)c1ccc(F)cc1
Show InChI InChI=1S/C19H23FN4O/c1-25-22-18(16-5-7-17(20)8-6-16)9-11-23-12-14-24(15-13-23)19-4-2-3-10-21-19/h2-8,10H,9,11-15H2,1H3/b22-18-
Reactome pathway
53.3n/an/an/an/an/an/an/an/a
Abbott Laboratories
Curated by ChEMBL
Assay Description
Displacement of [3H]A-369508 from human recombinant D4.4 receptor expressed in HEK293 cell membrane
J Med Chem 49: 5093-109 (2006)
Article DOI: 10.1021/jm060279f
BindingDB Entry DOI: 10.7270/Q2CJ8D4B
D(2) dopamine receptor
(Homo sapiens (Human))
BDBM50193334
((Z)-1-(4-fluorophenyl)-3-(4-pyridin-2-ylpiperazin-...)
Show SMILES CO\N=C(\CCN1CCN(CC1)c1ccccn1)c1ccc(F)cc1
Show InChI InChI=1S/C19H23FN4O/c1-25-22-18(16-5-7-17(20)8-6-16)9-11-23-12-14-24(15-13-23)19-4-2-3-10-21-19/h2-8,10H,9,11-15H2,1H3/b22-18-
Reactome pathway
221n/an/an/an/an/an/an/an/a
Abbott Laboratories
Curated by ChEMBL
Assay Description
Displacement of [3H]PIPAT from human recombinant D2L receptor expressed in HEK293 cells
J Med Chem 49: 5093-109 (2006)
Article DOI: 10.1021/jm060279f
BindingDB Entry DOI: 10.7270/Q2CJ8D4B
D(2) dopamine receptor
(Homo sapiens (Human))
BDBM50193334
((Z)-1-(4-fluorophenyl)-3-(4-pyridin-2-ylpiperazin-...)
Show SMILES CO\N=C(\CCN1CCN(CC1)c1ccccn1)c1ccc(F)cc1
Show InChI InChI=1S/C19H23FN4O/c1-25-22-18(16-5-7-17(20)8-6-16)9-11-23-12-14-24(15-13-23)19-4-2-3-10-21-19/h2-8,10H,9,11-15H2,1H3/b22-18-
Reactome pathway
n/an/an/an/a>1.00E+4n/an/an/an/a
Abbott Laboratories
Curated by ChEMBL
Assay Description
Agonist activity at human recombinant D2 receptor expressed in HEK293 cells by FLIPR assay
J Med Chem 49: 5093-109 (2006)
Article DOI: 10.1021/jm060279f
BindingDB Entry DOI: 10.7270/Q2CJ8D4B
D(4) dopamine receptor
(Homo sapiens (Human))
BDBM50193334
((Z)-1-(4-fluorophenyl)-3-(4-pyridin-2-ylpiperazin-...)
Show SMILES CO\N=C(\CCN1CCN(CC1)c1ccccn1)c1ccc(F)cc1
Show InChI InChI=1S/C19H23FN4O/c1-25-22-18(16-5-7-17(20)8-6-16)9-11-23-12-14-24(15-13-23)19-4-2-3-10-21-19/h2-8,10H,9,11-15H2,1H3/b22-18-
Reactome pathway
n/an/an/an/a 13.6n/an/an/an/a
Abbott Laboratories
Curated by ChEMBL
Assay Description
Activity at human recombinant D4.4 receptor expressed in HEK293 cells by FLIPR assay
J Med Chem 49: 5093-109 (2006)
Article DOI: 10.1021/jm060279f
BindingDB Entry DOI: 10.7270/Q2CJ8D4B
D(2) dopamine receptor
(Homo sapiens (Human))
BDBM50193334
((Z)-1-(4-fluorophenyl)-3-(4-pyridin-2-ylpiperazin-...)
Show SMILES CO\N=C(\CCN1CCN(CC1)c1ccccn1)c1ccc(F)cc1
Show InChI InChI=1S/C19H23FN4O/c1-25-22-18(16-5-7-17(20)8-6-16)9-11-23-12-14-24(15-13-23)19-4-2-3-10-21-19/h2-8,10H,9,11-15H2,1H3/b22-18-
Reactome pathway
n/an/a>1.00E+4n/an/an/an/an/an/a
Abbott Laboratories
Curated by ChEMBL
Assay Description
Antagonist activity at human recombinant D2 receptor expressed in HEK293 cells by FLIPR assay
J Med Chem 49: 5093-109 (2006)
Article DOI: 10.1021/jm060279f
BindingDB Entry DOI: 10.7270/Q2CJ8D4B