BDBM50193525 (Z)-6-(4-cyanophenyl)-6-(2,3-dihydro-3,7-dimethyl-2-oxobenzoxazol-5-yl)hex-5-enoic acid methyl ester::CHEMBL215542
SMILES: COC(=O)CCC\C=C(\c1ccc(cc1)C#N)c1cc(C)c2oc(=O)n(C)c2c1
InChI Key: InChIKey=AXMOPORLSRSZQK-SWNXQHNESA-N
Data: 1 IC50
Activity Spreadsheet -- Enzyme Inhibition Constant Data from BindingDB
Found 1 hit for monomerid = 50193525
Trg + Lig
Ki
nM
ΔG°
kcal/mole
IC50
nM
Kd
nM
EC50/IC50
nM
koff
s-1
kon
M-1s-1
pHTemp
°C
Human immunodeficiency virus type 1 reverse transcriptase
(Human immunodeficiency virus 1)
BDBM50193525
((Z)-6-(4-cyanophenyl)-6-(2,3-dihydro-3,7-dimethyl-...)
Show SMILES COC(=O)CCC\C=C(\c1ccc(cc1)C#N)c1cc(C)c2oc(=O)n(C)c2c1
Show InChI InChI=1S/C23H22N2O4/c1-15-12-18(13-20-22(15)29-23(27)25(20)2)19(6-4-5-7-21(26)28-3)17-10-8-16(14-24)9-11-17/h6,8-13H,4-5,7H2,1-3H3/b19-6-
n/an/a 1.20E+3n/an/an/an/an/an/a
Purdue University
Curated by ChEMBL
Assay Description
Inhibition of recombinant HIV1 reverse transcriptase measured as inhibition of incorporation of [32P]GTP in rCDG primer
J Med Chem 49: 5316-23 (2006)
Article DOI: 10.1021/jm060449o
BindingDB Entry DOI: 10.7270/Q2QV3M5K