BDBM50193656 CHEMBL3947760
SMILES: Cc1[nH]ncc1-c1cc(Cl)c2CCN(Cc3c(C)cc(C)[nH]c3=O)C(=O)c2c1Cl
InChI Key: InChIKey=UDCPWEVIJPGGIA-UHFFFAOYSA-N
Data: 2 IC50
Activity Spreadsheet -- Enzyme Inhibition Constant Data from BindingDB
Found 2 hits for monomerid = 50193656
Trg + Lig
Ki
nM
ΔG°
kcal/mole
IC50
nM
Kd
nM
EC50/IC50
nM
koff
s-1
kon
M-1s-1
pHTemp
°C
Histone-lysine N-methyltransferase EZH2
(Homo sapiens (Human))
BDBM50193656
(CHEMBL3947760)
Show SMILES Cc1[nH]ncc1-c1cc(Cl)c2CCN(Cc3c(C)cc(C)[nH]c3=O)C(=O)c2c1Cl
Show InChI InChI=1S/C21H20Cl2N4O2/c1-10-6-11(2)25-20(28)16(10)9-27-5-4-13-17(22)7-14(15-8-24-26-12(15)3)19(23)18(13)21(27)29/h6-8H,4-5,9H2,1-3H3,(H,24,26)(H,25,28)
n/an/a 873n/an/an/an/an/an/a
Pfizer Inc.
Curated by ChEMBL
Assay Description
Inhibition of EZH2 in human KARPAS422 cells assessed as reduction in H3K27Me3 levels after 72 hrs by ELISA
J Med Chem 59: 8306-25 (2016)
Article DOI: 10.1021/acs.jmedchem.6b00515
BindingDB Entry DOI: 10.7270/Q2J1053B
Histone-lysine N-methyltransferase EZH2
(Homo sapiens (Human))
BDBM50193656
(CHEMBL3947760)
Show SMILES Cc1[nH]ncc1-c1cc(Cl)c2CCN(Cc3c(C)cc(C)[nH]c3=O)C(=O)c2c1Cl
Show InChI InChI=1S/C21H20Cl2N4O2/c1-10-6-11(2)25-20(28)16(10)9-27-5-4-13-17(22)7-14(15-8-24-26-12(15)3)19(23)18(13)21(27)29/h6-8H,4-5,9H2,1-3H3,(H,24,26)(H,25,28)
n/an/a 24n/an/an/an/an/an/a
Pfizer Inc.
Curated by ChEMBL
Assay Description
Inhibition of wild-type EZH2 (unknown origin) expressed in baculovirus infected SF9 cells co-expressing SUZ12/EED/RbAp48 complex using HeLa cells der...
J Med Chem 59: 8306-25 (2016)
Article DOI: 10.1021/acs.jmedchem.6b00515
BindingDB Entry DOI: 10.7270/Q2J1053B