BDBM50193658 CHEMBL3946272
SMILES: Cc1cc(C)c(CN2CCc3c(F)cc(O[C@@H]4CCOC4)c(Cl)c3C2=O)c(=O)[nH]1
InChI Key: InChIKey=CACYQTYWIIXHOP-CYBMUJFWSA-N
Data: 2 IC50
Activity Spreadsheet -- Enzyme Inhibition Constant Data from BindingDB
Found 2 hits for monomerid = 50193658
Trg + Lig
Ki
nM
ΔG°
kcal/mole
IC50
nM
Kd
nM
EC50/IC50
nM
koff
s-1
kon
M-1s-1
pHTemp
°C
Histone-lysine N-methyltransferase EZH2
(Homo sapiens (Human))
BDBM50193658
(CHEMBL3946272)
Show SMILES Cc1cc(C)c(CN2CCc3c(F)cc(O[C@@H]4CCOC4)c(Cl)c3C2=O)c(=O)[nH]1 |r|
Show InChI InChI=1S/C21H22ClFN2O4/c1-11-7-12(2)24-20(26)15(11)9-25-5-3-14-16(23)8-17(19(22)18(14)21(25)27)29-13-4-6-28-10-13/h7-8,13H,3-6,9-10H2,1-2H3,(H,24,26)/t13-/m1/s1
n/an/a 56n/an/an/an/an/an/a
Pfizer Inc.
Curated by ChEMBL
Assay Description
Inhibition of wild-type EZH2 (unknown origin) expressed in baculovirus infected SF9 cells co-expressing SUZ12/EED/RbAp48 complex using HeLa cells der...
J Med Chem 59: 8306-25 (2016)
Article DOI: 10.1021/acs.jmedchem.6b00515
BindingDB Entry DOI: 10.7270/Q2J1053B
Histone-lysine N-methyltransferase EZH2
(Homo sapiens (Human))
BDBM50193658
(CHEMBL3946272)
Show SMILES Cc1cc(C)c(CN2CCc3c(F)cc(O[C@@H]4CCOC4)c(Cl)c3C2=O)c(=O)[nH]1 |r|
Show InChI InChI=1S/C21H22ClFN2O4/c1-11-7-12(2)24-20(26)15(11)9-25-5-3-14-16(23)8-17(19(22)18(14)21(25)27)29-13-4-6-28-10-13/h7-8,13H,3-6,9-10H2,1-2H3,(H,24,26)/t13-/m1/s1
n/an/a 994n/an/an/an/an/an/a
Pfizer Inc.
Curated by ChEMBL
Assay Description
Inhibition of EZH2 in human KARPAS422 cells assessed as reduction in H3K27Me3 levels after 72 hrs by ELISA
J Med Chem 59: 8306-25 (2016)
Article DOI: 10.1021/acs.jmedchem.6b00515
BindingDB Entry DOI: 10.7270/Q2J1053B