BDBM50193676 CHEMBL215331::N-(2-(dimethylamino)quinolin-6-yl)-3-(4-(trifluoromethyl)phenyl)propanamide::N-(2-(pyrrolidin-1-yl)quinolin-6-yl)-3-(4-(trifluoromethyl)phenyl)propanamide
SMILES: FC(F)(F)c1ccc(CCC(=O)Nc2ccc3nc(ccc3c2)N2CCCC2)cc1
InChI Key: InChIKey=MVQARQYRYGFFIV-UHFFFAOYSA-N
Data: 1 IC50  1 EC50
Activity Spreadsheet -- Enzyme Inhibition Constant Data from BindingDB
Found 2 hits for monomerid = 50193676
Trg + Lig
Ki
nM
ΔG°
kcal/mole
IC50
nM
Kd
nM
EC50/IC50
nM
koff
s-1
kon
M-1s-1
pHTemp
°C
Melanin-concentrating hormone receptor 1
(RAT)
BDBM50193676
(CHEMBL215331 | N-(2-(dimethylamino)quinolin-6-yl)-...)
Show SMILES FC(F)(F)c1ccc(CCC(=O)Nc2ccc3nc(ccc3c2)N2CCCC2)cc1
Show InChI InChI=1S/C23H22F3N3O/c24-23(25,26)18-7-3-16(4-8-18)5-12-22(30)27-19-9-10-20-17(15-19)6-11-21(28-20)29-13-1-2-14-29/h3-4,6-11,15H,1-2,5,12-14H2,(H,27,30)
Reactome pathway
n/an/an/an/a 320n/an/an/an/a
Merck Research Laboratories
Curated by ChEMBL
Assay Description
Stimulation of IP3-coupled mobilization of calcium in HEK293 cells expressing rat MCH-R1
Bioorg Med Chem Lett 16: 5270-4 (2006)
Article DOI: 10.1016/j.bmcl.2006.08.006
BindingDB Entry DOI: 10.7270/Q2ZC82HP
Melanin-concentrating hormone receptor 1
(Homo sapiens (Human))
BDBM50193676
(CHEMBL215331 | N-(2-(dimethylamino)quinolin-6-yl)-...)
Show SMILES FC(F)(F)c1ccc(CCC(=O)Nc2ccc3nc(ccc3c2)N2CCCC2)cc1
Show InChI InChI=1S/C23H22F3N3O/c24-23(25,26)18-7-3-16(4-8-18)5-12-22(30)27-19-9-10-20-17(15-19)6-11-21(28-20)29-13-1-2-14-29/h3-4,6-11,15H,1-2,5,12-14H2,(H,27,30)
Reactome pathway
n/an/a 3n/an/an/an/an/an/a
Merck Research Laboratories
Curated by ChEMBL
Assay Description
Displacement of 125I-[Phe13,Tyr19]-MCH from human MCH-R1
Bioorg Med Chem Lett 16: 5270-4 (2006)
Article DOI: 10.1016/j.bmcl.2006.08.006
BindingDB Entry DOI: 10.7270/Q2ZC82HP