BDBM50193767 1-(3-((2S,4R)-4-(4-fluorobenzyl)-1-propylpiperidin-2-yl)propyl)-3-(3-acetylphenyl)urea::CHEMBL221067
SMILES: CCCN1CC[C@@H](Cc2ccc(F)cc2)C[C@@H]1CCCNC(=O)Nc1cccc(c1)C(C)=O
InChI Key: InChIKey=SHAKAEUQTANHLB-NVQXNPDNSA-N
Data: 3 KI  1 IC50
Activity Spreadsheet -- Enzyme Inhibition Constant Data from BindingDB
Found 4 hits for monomerid = 50193767
Trg + Lig
Ki
nM
ΔG°
kcal/mole
IC50
nM
Kd
nM
EC50/IC50
nM
koff
s-1
kon
M-1s-1
pHTemp
°C
Sodium-dependent serotonin transporter
(Homo sapiens (Human))
BDBM50193767
(1-(3-((2S,4R)-4-(4-fluorobenzyl)-1-propylpiperidin...)
Show SMILES CCCN1CC[C@@H](Cc2ccc(F)cc2)C[C@@H]1CCCNC(=O)Nc1cccc(c1)C(C)=O
Show InChI InChI=1S/C27H36FN3O2/c1-3-15-31-16-13-22(17-21-9-11-24(28)12-10-21)18-26(31)8-5-14-29-27(33)30-25-7-4-6-23(19-25)20(2)32/h4,6-7,9-12,19,22,26H,3,5,8,13-18H2,1-2H3,(H2,29,30,33)/t22-,26-/m0/s1
296n/an/an/an/an/an/an/an/a
Bristol-Myers Squibb Pharmaceutical Research Institute
Curated by ChEMBL
Assay Description
Inhibition of 5HTT
Bioorg Med Chem Lett 16: 5695-9 (2006)
Article DOI: 10.1016/j.bmcl.2006.08.012
BindingDB Entry DOI: 10.7270/Q29K49VQ
Sodium-dependent dopamine transporter
(Homo sapiens (Human))
BDBM50193767
(1-(3-((2S,4R)-4-(4-fluorobenzyl)-1-propylpiperidin...)
Show SMILES CCCN1CC[C@@H](Cc2ccc(F)cc2)C[C@@H]1CCCNC(=O)Nc1cccc(c1)C(C)=O
Show InChI InChI=1S/C27H36FN3O2/c1-3-15-31-16-13-22(17-21-9-11-24(28)12-10-21)18-26(31)8-5-14-29-27(33)30-25-7-4-6-23(19-25)20(2)32/h4,6-7,9-12,19,22,26H,3,5,8,13-18H2,1-2H3,(H2,29,30,33)/t22-,26-/m0/s1
NCI pathway
Reactome pathway
756n/an/an/an/an/an/an/an/a
Bristol-Myers Squibb Pharmaceutical Research Institute
Curated by ChEMBL
Assay Description
Inhibition of DAT
Bioorg Med Chem Lett 16: 5695-9 (2006)
Article DOI: 10.1016/j.bmcl.2006.08.012
BindingDB Entry DOI: 10.7270/Q29K49VQ
Sodium-dependent noradrenaline transporter
(Homo sapiens (Human))
BDBM50193767
(1-(3-((2S,4R)-4-(4-fluorobenzyl)-1-propylpiperidin...)
Show SMILES CCCN1CC[C@@H](Cc2ccc(F)cc2)C[C@@H]1CCCNC(=O)Nc1cccc(c1)C(C)=O
Show InChI InChI=1S/C27H36FN3O2/c1-3-15-31-16-13-22(17-21-9-11-24(28)12-10-21)18-26(31)8-5-14-29-27(33)30-25-7-4-6-23(19-25)20(2)32/h4,6-7,9-12,19,22,26H,3,5,8,13-18H2,1-2H3,(H2,29,30,33)/t22-,26-/m0/s1
Reactome pathway
4.17E+3n/an/an/an/an/an/an/an/a
Bristol-Myers Squibb Pharmaceutical Research Institute
Curated by ChEMBL
Assay Description
Inhibition of NET
Bioorg Med Chem Lett 16: 5695-9 (2006)
Article DOI: 10.1016/j.bmcl.2006.08.012
BindingDB Entry DOI: 10.7270/Q29K49VQ
C-C chemokine receptor type 3
(Homo sapiens (Human))
BDBM50193767
(1-(3-((2S,4R)-4-(4-fluorobenzyl)-1-propylpiperidin...)
Show SMILES CCCN1CC[C@@H](Cc2ccc(F)cc2)C[C@@H]1CCCNC(=O)Nc1cccc(c1)C(C)=O
Show InChI InChI=1S/C27H36FN3O2/c1-3-15-31-16-13-22(17-21-9-11-24(28)12-10-21)18-26(31)8-5-14-29-27(33)30-25-7-4-6-23(19-25)20(2)32/h4,6-7,9-12,19,22,26H,3,5,8,13-18H2,1-2H3,(H2,29,30,33)/t22-,26-/m0/s1
Reactome pathway
n/an/a 2n/an/an/an/an/an/a
Bristol-Myers Squibb Pharmaceutical Research Institute
Curated by ChEMBL
Assay Description
Binding affinity to CCR3
Bioorg Med Chem Lett 16: 5695-9 (2006)
Article DOI: 10.1016/j.bmcl.2006.08.012
BindingDB Entry DOI: 10.7270/Q29K49VQ