BDBM50193772 1-(3-((2S,4R)-4-(4-fluorobenzyl)-1-(2-amino-2-oxoethyl)piperidin-2-yl)propyl)-3-(3,5-diacetylphenyl)urea::CHEMBL385607
SMILES: CC(=O)c1cc(NC(=O)NCCC[C@H]2C[C@H](Cc3ccc(F)cc3)CCN2CC(N)=O)cc(c1)C(C)=O
InChI Key: InChIKey=BRTWZDQCGNRNRK-LVXARBLLSA-N
Data: 3 KI  1 IC50
Activity Spreadsheet -- Enzyme Inhibition Constant Data from BindingDB
Found 4 hits for monomerid = 50193772
Trg + Lig
Ki
nM
ΔG°
kcal/mole
IC50
nM
Kd
nM
EC50/IC50
nM
koff
s-1
kon
M-1s-1
pHTemp
°C
Sodium-dependent serotonin transporter
(Homo sapiens (Human))
BDBM50193772
(1-(3-((2S,4R)-4-(4-fluorobenzyl)-1-(2-amino-2-oxoe...)
Show SMILES CC(=O)c1cc(NC(=O)NCCC[C@H]2C[C@H](Cc3ccc(F)cc3)CCN2CC(N)=O)cc(c1)C(C)=O
Show InChI InChI=1S/C28H35FN4O4/c1-18(34)22-14-23(19(2)35)16-25(15-22)32-28(37)31-10-3-4-26-13-21(9-11-33(26)17-27(30)36)12-20-5-7-24(29)8-6-20/h5-8,14-16,21,26H,3-4,9-13,17H2,1-2H3,(H2,30,36)(H2,31,32,37)/t21-,26-/m0/s1
710n/an/an/an/an/an/an/an/a
Bristol-Myers Squibb Pharmaceutical Research Institute
Curated by ChEMBL
Assay Description
Inhibition of 5HTT
Bioorg Med Chem Lett 16: 5695-9 (2006)
Article DOI: 10.1016/j.bmcl.2006.08.012
BindingDB Entry DOI: 10.7270/Q29K49VQ
Sodium-dependent dopamine transporter
(Homo sapiens (Human))
BDBM50193772
(1-(3-((2S,4R)-4-(4-fluorobenzyl)-1-(2-amino-2-oxoe...)
Show SMILES CC(=O)c1cc(NC(=O)NCCC[C@H]2C[C@H](Cc3ccc(F)cc3)CCN2CC(N)=O)cc(c1)C(C)=O
Show InChI InChI=1S/C28H35FN4O4/c1-18(34)22-14-23(19(2)35)16-25(15-22)32-28(37)31-10-3-4-26-13-21(9-11-33(26)17-27(30)36)12-20-5-7-24(29)8-6-20/h5-8,14-16,21,26H,3-4,9-13,17H2,1-2H3,(H2,30,36)(H2,31,32,37)/t21-,26-/m0/s1
NCI pathway
Reactome pathway
2.66E+3n/an/an/an/an/an/an/an/a
Bristol-Myers Squibb Pharmaceutical Research Institute
Curated by ChEMBL
Assay Description
Inhibition of DAT
Bioorg Med Chem Lett 16: 5695-9 (2006)
Article DOI: 10.1016/j.bmcl.2006.08.012
BindingDB Entry DOI: 10.7270/Q29K49VQ
Sodium-dependent noradrenaline transporter
(Homo sapiens (Human))
BDBM50193772
(1-(3-((2S,4R)-4-(4-fluorobenzyl)-1-(2-amino-2-oxoe...)
Show SMILES CC(=O)c1cc(NC(=O)NCCC[C@H]2C[C@H](Cc3ccc(F)cc3)CCN2CC(N)=O)cc(c1)C(C)=O
Show InChI InChI=1S/C28H35FN4O4/c1-18(34)22-14-23(19(2)35)16-25(15-22)32-28(37)31-10-3-4-26-13-21(9-11-33(26)17-27(30)36)12-20-5-7-24(29)8-6-20/h5-8,14-16,21,26H,3-4,9-13,17H2,1-2H3,(H2,30,36)(H2,31,32,37)/t21-,26-/m0/s1
Reactome pathway
5.01E+3n/an/an/an/an/an/an/an/a
Bristol-Myers Squibb Pharmaceutical Research Institute
Curated by ChEMBL
Assay Description
Inhibition of NET
Bioorg Med Chem Lett 16: 5695-9 (2006)
Article DOI: 10.1016/j.bmcl.2006.08.012
BindingDB Entry DOI: 10.7270/Q29K49VQ
C-C chemokine receptor type 3
(Homo sapiens (Human))
BDBM50193772
(1-(3-((2S,4R)-4-(4-fluorobenzyl)-1-(2-amino-2-oxoe...)
Show SMILES CC(=O)c1cc(NC(=O)NCCC[C@H]2C[C@H](Cc3ccc(F)cc3)CCN2CC(N)=O)cc(c1)C(C)=O
Show InChI InChI=1S/C28H35FN4O4/c1-18(34)22-14-23(19(2)35)16-25(15-22)32-28(37)31-10-3-4-26-13-21(9-11-33(26)17-27(30)36)12-20-5-7-24(29)8-6-20/h5-8,14-16,21,26H,3-4,9-13,17H2,1-2H3,(H2,30,36)(H2,31,32,37)/t21-,26-/m0/s1
Reactome pathway
n/an/a 3.60n/an/an/an/an/an/a
Bristol-Myers Squibb Pharmaceutical Research Institute
Curated by ChEMBL
Assay Description
Binding affinity to CCR3
Bioorg Med Chem Lett 16: 5695-9 (2006)
Article DOI: 10.1016/j.bmcl.2006.08.012
BindingDB Entry DOI: 10.7270/Q29K49VQ