BDBM50193821 CHEMBL3917455
SMILES: [H][C@@]12C[C@@]([H])(C=C1)[C@@H]([C@@H]2Nc1nc(Nc2ccc3CCCC(Cc3c2OC)N2CCOCC2)ncc1Cl)C(N)=O
InChI Key: InChIKey=JRMTXRDNLDNASC-WAWLPEEXSA-N
Data: 2 IC50
Activity Spreadsheet -- Enzyme Inhibition Constant Data from BindingDB
Found 2 hits for monomerid = 50193821
Trg + Lig
Ki
nM
ΔG°
kcal/mole
IC50
nM
Kd
nM
EC50/IC50
nM
koff
s-1
kon
M-1s-1
pHTemp
°C
ALK tyrosine kinase receptor
(Homo sapiens (Human))
BDBM50193821
(CHEMBL3917455)
Show SMILES [H][C@@]12C[C@@]([H])(C=C1)[C@@H]([C@@H]2Nc1nc(Nc2ccc3CCCC(Cc3c2OC)N2CCOCC2)ncc1Cl)C(N)=O |r,c:5|
Show InChI InChI=1S/C28H35ClN6O3/c1-37-25-20-14-19(35-9-11-38-12-10-35)4-2-3-16(20)7-8-22(25)32-28-31-15-21(29)27(34-28)33-24-18-6-5-17(13-18)23(24)26(30)36/h5-8,15,17-19,23-24H,2-4,9-14H2,1H3,(H2,30,36)(H2,31,32,33,34)/t17-,18+,19?,23+,24-/m1/s1
n/an/a 39n/an/an/an/an/an/a
Teva Branded Pharmaceutical Products R&D
Curated by ChEMBL
Assay Description
Inhibition of human ALK expressed in baculovirus using recombinant GST PLC-gamma as substrate assessed as phosphorylation of the substrate after 15 m...
J Med Chem 59: 7478-96 (2016)
Article DOI: 10.1021/acs.jmedchem.6b00487
BindingDB Entry DOI: 10.7270/Q2D79DC2
Insulin receptor
(Homo sapiens (Human))
BDBM50193821
(CHEMBL3917455)
Show SMILES [H][C@@]12C[C@@]([H])(C=C1)[C@@H]([C@@H]2Nc1nc(Nc2ccc3CCCC(Cc3c2OC)N2CCOCC2)ncc1Cl)C(N)=O |r,c:5|
Show InChI InChI=1S/C28H35ClN6O3/c1-37-25-20-14-19(35-9-11-38-12-10-35)4-2-3-16(20)7-8-22(25)32-28-31-15-21(29)27(34-28)33-24-18-6-5-17(13-18)23(24)26(30)36/h5-8,15,17-19,23-24H,2-4,9-14H2,1H3,(H2,30,36)(H2,31,32,33,34)/t17-,18+,19?,23+,24-/m1/s1
n/an/a>1.00E+4n/an/an/an/an/an/a
Teva Branded Pharmaceutical Products R&D
Curated by ChEMBL
Assay Description
Inhibition of recombinant human INSR expressed in baculovirus using ATP as substrate after 15 mins by TRF assay
J Med Chem 59: 7478-96 (2016)
Article DOI: 10.1021/acs.jmedchem.6b00487
BindingDB Entry DOI: 10.7270/Q2D79DC2