BDBM50193913 7-(2,6-dimethylphenyl)-5-methylbenzo[e][1,2,4]triazin-3-amine::CHEMBL218177
SMILES: Cc1cccc(C)c1-c1cc(C)c2nc(N)nnc2c1
InChI Key: InChIKey=INDZZBNLRBLVPY-UHFFFAOYSA-N
Data: 1 IC50
Activity Spreadsheet -- Enzyme Inhibition Constant Data from BindingDB
Found 1 hit for monomerid = 50193913
Trg + Lig
Ki
nM
ΔG°
kcal/mole
IC50
nM
Kd
nM
EC50/IC50
nM
koff
s-1
kon
M-1s-1
pHTemp
°C
Proto-oncogene tyrosine-protein kinase Src
(Homo sapiens (Human))
BDBM50193913
(7-(2,6-dimethylphenyl)-5-methylbenzo[e][1,2,4]tria...)
Show SMILES Cc1cccc(C)c1-c1cc(C)c2nc(N)nnc2c1
Show InChI InChI=1S/C16H16N4/c1-9-5-4-6-10(2)14(9)12-7-11(3)15-13(8-12)19-20-16(17)18-15/h4-8H,1-3H3,(H2,17,18,20)
n/an/a 7.40E+3n/an/an/an/an/an/a
TargeGen, Inc.
Curated by ChEMBL
Assay Description
Inhibition of human recombinant Src kinase
Bioorg Med Chem Lett 16: 5546-50 (2006)
Article DOI: 10.1016/j.bmcl.2006.08.035
BindingDB Entry DOI: 10.7270/Q2SN08MP