BDBM50194110 (S)-N-(1-(7-(4-aminobutylamino)heptylamino)-3-(4-hydroxyphenyl)-1-oxopropan-2-yl)butyramide::CHEMBL213645::Philanthotoxin-74
SMILES: CCCC(=O)N[C@@H](Cc1ccc(O)cc1)C(=O)NCCCCCCCNCCCCN
InChI Key: InChIKey=YKCMCIWNASWOOP-QFIPXVFZSA-N
Data: 2 KI
Activity Spreadsheet -- Enzyme Inhibition Constant Data from BindingDB
Found 2 hits for monomerid = 50194110
Trg + Lig
Ki
nM
ΔG°
kcal/mole
IC50
nM
Kd
nM
EC50/IC50
nM
koff
s-1
kon
M-1s-1
pHTemp
°C
GRIA1
(Homo sapiens (Human))
BDBM50194110
((S)-N-(1-(7-(4-aminobutylamino)heptylamino)-3-(4-h...)
Show SMILES CCCC(=O)N[C@@H](Cc1ccc(O)cc1)C(=O)NCCCCCCCNCCCCN
Show InChI InChI=1S/C24H42N4O3/c1-2-10-23(30)28-22(19-20-11-13-21(29)14-12-20)24(31)27-18-8-5-3-4-7-16-26-17-9-6-15-25/h11-14,22,26,29H,2-10,15-19,25H2,1H3,(H,27,31)(H,28,30)/t22-/m0/s1
168n/an/an/an/an/an/an/an/a
University of California
Curated by ChEMBL
Assay Description
Inhibition of recombinant GluA1 receptor flip isoform expressed in Xenopus oocytes assessed as inhibition of 100 uM glutamate-induced current
Bioorg Med Chem 18: 1381-7 (2010)
Article DOI: 10.1016/j.bmc.2009.12.072
BindingDB Entry DOI: 10.7270/Q27W6CB2
Glutamate receptor 1
(Rattus norvegicus (Rat))
BDBM50194110
((S)-N-(1-(7-(4-aminobutylamino)heptylamino)-3-(4-h...)
Show SMILES CCCC(=O)N[C@@H](Cc1ccc(O)cc1)C(=O)NCCCCCCCNCCCCN
Show InChI InChI=1S/C24H42N4O3/c1-2-10-23(30)28-22(19-20-11-13-21(29)14-12-20)24(31)27-18-8-5-3-4-7-16-26-17-9-6-15-25/h11-14,22,26,29H,2-10,15-19,25H2,1H3,(H,27,31)(H,28,30)/t22-/m0/s1
168n/an/an/an/an/an/an/an/a
The Danish University of Pharmaceutical Sciences
Curated by ChEMBL
Assay Description
Antagonist activity against rat GluR1 flop expressed in Xenopus laevis oocyte assessed as inhibition of glutamate-induced current at holding potentia...
J Med Chem 49: 5414-23 (2006)
Article DOI: 10.1021/jm060606j
BindingDB Entry DOI: 10.7270/Q24X57FS