BDBM50194288 5-(2-ethoxyethyl)-5-(4-(4-(4-(pyridin-2-yl)oxazol-2-yl)phenoxy)phenoxy)pyrimidine-2,4,6(1H,3H,5H)-trione::CHEMBL221685
SMILES: CCOCCC1(Oc2ccc(Oc3ccc(cc3)-c3nc(co3)-c3ccccn3)cc2)C(=O)NC(=O)NC1=O
InChI Key: InChIKey=FMEAQXZJDJBJJP-UHFFFAOYSA-N
Data: 1 IC50
Activity Spreadsheet -- Enzyme Inhibition Constant Data from BindingDB
Found 1 hit for monomerid = 50194288
Trg + Lig
Ki
nM
ΔG°
kcal/mole
IC50
nM
Kd
nM
EC50/IC50
nM
koff
s-1
kon
M-1s-1
pHTemp
°C
Collagenase 3
(Homo sapiens (Human))
BDBM50194288
(5-(2-ethoxyethyl)-5-(4-(4-(4-(pyridin-2-yl)oxazol-...)
Show SMILES CCOCCC1(Oc2ccc(Oc3ccc(cc3)-c3nc(co3)-c3ccccn3)cc2)C(=O)NC(=O)NC1=O
Show InChI InChI=1S/C28H24N4O7/c1-2-36-16-14-28(25(33)31-27(35)32-26(28)34)39-21-12-10-20(11-13-21)38-19-8-6-18(7-9-19)24-30-23(17-37-24)22-5-3-4-15-29-22/h3-13,15,17H,2,14,16H2,1H3,(H2,31,32,33,34,35)
NCI pathway
Reactome pathway
n/an/a 1n/an/an/an/an/an/a
Pfizer Global Research & Development
Curated by ChEMBL
Assay Description
Inhibition of MMP13
Bioorg Med Chem Lett 16: 5822-6 (2006)
Article DOI: 10.1016/j.bmcl.2006.08.066
BindingDB Entry DOI: 10.7270/Q27P8Z1R