BDBM50194574 CHEMBL385738::N'-[3-(2-dimethylamino-ethoxy)-2-phenyl-quinoline-4-carbonyl]-N-phenyl-hydrazinecarboxylic acid methyl ester
SMILES: COC(=O)N(NC(=O)c1c(OCCN(C)C)c(nc2ccccc12)-c1ccccc1)c1ccccc1
InChI Key: InChIKey=XCCMZNKLKPVPJT-UHFFFAOYSA-N
Data: 1 KI  1 IC50
Activity Spreadsheet -- Enzyme Inhibition Constant Data from BindingDB
Found 2 hits for monomerid = 50194574
Trg + Lig
Ki
nM
ΔG°
kcal/mole
IC50
nM
Kd
nM
EC50/IC50
nM
koff
s-1
kon
M-1s-1
pHTemp
°C
Potassium voltage-gated channel subfamily H member 2
(Homo sapiens (Human))
BDBM50194574
(CHEMBL385738 | N'-[3-(2-dimethylamino-ethoxy)-2-ph...)
Show SMILES COC(=O)N(NC(=O)c1c(OCCN(C)C)c(nc2ccccc12)-c1ccccc1)c1ccccc1
Show InChI InChI=1S/C28H28N4O4/c1-31(2)18-19-36-26-24(27(33)30-32(28(34)35-3)21-14-8-5-9-15-21)22-16-10-11-17-23(22)29-25(26)20-12-6-4-7-13-20/h4-17H,18-19H2,1-3H3,(H,30,33)
Reactome pathway
89n/an/an/an/an/an/an/an/a
Merck Sharp & Dohme Research Laboratories
Curated by ChEMBL
Assay Description
Displacement of labeled MK499 from cloned hERG potassium channel expressed in HEK cells
Bioorg Med Chem Lett 16: 5752-6 (2006)
Article DOI: 10.1016/j.bmcl.2006.08.085
BindingDB Entry DOI: 10.7270/Q2TD9X0S
Neuromedin-K receptor
(Homo sapiens (Human))
BDBM50194574
(CHEMBL385738 | N'-[3-(2-dimethylamino-ethoxy)-2-ph...)
Show SMILES COC(=O)N(NC(=O)c1c(OCCN(C)C)c(nc2ccccc12)-c1ccccc1)c1ccccc1
Show InChI InChI=1S/C28H28N4O4/c1-31(2)18-19-36-26-24(27(33)30-32(28(34)35-3)21-14-8-5-9-15-21)22-16-10-11-17-23(22)29-25(26)20-12-6-4-7-13-20/h4-17H,18-19H2,1-3H3,(H,30,33)
Reactome pathway
n/an/a 11n/an/an/an/an/an/a
Merck Sharp & Dohme Research Laboratories
Curated by ChEMBL
Assay Description
Displacement of [125I]neurokinin B from human cloned NK3 receptor expressed in CHO cells
Bioorg Med Chem Lett 16: 5752-6 (2006)
Article DOI: 10.1016/j.bmcl.2006.08.085
BindingDB Entry DOI: 10.7270/Q2TD9X0S