BDBM50194952 2-((6-(2-(5-methyl-2-phenyloxazol-4-yl)ethoxy)pyridin-3-yl)methyl)-tetrahydro-2H-pyran-2-carboxylic acid::CHEMBL220533
SMILES: Cc1oc(nc1CCOc1ccc(CC2(CCCCO2)C(O)=O)cn1)-c1ccccc1
InChI Key: InChIKey=HEIMHRZFDOAASV-UHFFFAOYSA-N
Data: 1 KI  3 EC50
Activity Spreadsheet -- Enzyme Inhibition Constant Data from BindingDB
Found 4 hits for monomerid = 50194952
Trg + Lig
Ki
nM
ΔG°
kcal/mole
IC50
nM
Kd
nM
EC50/IC50
nM
koff
s-1
kon
M-1s-1
pHTemp
°C
Peroxisome proliferator-activated receptor
(Homo sapiens (Human))
BDBM50194952
(2-((6-(2-(5-methyl-2-phenyloxazol-4-yl)ethoxy)pyri...)
Show SMILES Cc1oc(nc1CCOc1ccc(CC2(CCCCO2)C(O)=O)cn1)-c1ccccc1
Show InChI InChI=1S/C24H26N2O5/c1-17-20(26-22(31-17)19-7-3-2-4-8-19)11-14-29-21-10-9-18(16-25-21)15-24(23(27)28)12-5-6-13-30-24/h2-4,7-10,16H,5-6,11-15H2,1H3,(H,27,28)
NCI pathway
Reactome pathway
81n/an/an/an/an/an/an/an/a
Pfizer Global R&D
Curated by ChEMBL
Assay Description
Displacement of radiolabeled darglitazone from human PPAR gamma by SPA binding assay
Bioorg Med Chem Lett 16: 6120-3 (2006)
Article DOI: 10.1016/j.bmcl.2006.08.110
BindingDB Entry DOI: 10.7270/Q20Z72XV
Peroxisome proliferator-activated receptor alpha (PPAR alpha)
(Homo sapiens (Human))
BDBM50194952
(2-((6-(2-(5-methyl-2-phenyloxazol-4-yl)ethoxy)pyri...)
Show SMILES Cc1oc(nc1CCOc1ccc(CC2(CCCCO2)C(O)=O)cn1)-c1ccccc1
Show InChI InChI=1S/C24H26N2O5/c1-17-20(26-22(31-17)19-7-3-2-4-8-19)11-14-29-21-10-9-18(16-25-21)15-24(23(27)28)12-5-6-13-30-24/h2-4,7-10,16H,5-6,11-15H2,1H3,(H,27,28)
n/an/an/an/a 78n/an/an/an/a
Pfizer Global R&D
Curated by ChEMBL
Assay Description
Displacement of radiolabeled GW2331 from human PPAR alpha by SPA binding assay
Bioorg Med Chem Lett 16: 6120-3 (2006)
Article DOI: 10.1016/j.bmcl.2006.08.110
BindingDB Entry DOI: 10.7270/Q20Z72XV
Peroxisome proliferator-activated receptor alpha (PPAR alpha)
(Homo sapiens (Human))
BDBM50194952
(2-((6-(2-(5-methyl-2-phenyloxazol-4-yl)ethoxy)pyri...)
Show SMILES Cc1oc(nc1CCOc1ccc(CC2(CCCCO2)C(O)=O)cn1)-c1ccccc1
Show InChI InChI=1S/C24H26N2O5/c1-17-20(26-22(31-17)19-7-3-2-4-8-19)11-14-29-21-10-9-18(16-25-21)15-24(23(27)28)12-5-6-13-30-24/h2-4,7-10,16H,5-6,11-15H2,1H3,(H,27,28)
n/an/an/an/a 228n/an/an/an/a
Pfizer Global R&D
Curated by ChEMBL
Assay Description
Agonist activity at human PPAR alpha in a HepG2 cells by PPAR-GAL4 transactivation assay
Bioorg Med Chem Lett 16: 6120-3 (2006)
Article DOI: 10.1016/j.bmcl.2006.08.110
BindingDB Entry DOI: 10.7270/Q20Z72XV
Peroxisome proliferator-activated receptor
(Homo sapiens (Human))
BDBM50194952
(2-((6-(2-(5-methyl-2-phenyloxazol-4-yl)ethoxy)pyri...)
Show SMILES Cc1oc(nc1CCOc1ccc(CC2(CCCCO2)C(O)=O)cn1)-c1ccccc1
Show InChI InChI=1S/C24H26N2O5/c1-17-20(26-22(31-17)19-7-3-2-4-8-19)11-14-29-21-10-9-18(16-25-21)15-24(23(27)28)12-5-6-13-30-24/h2-4,7-10,16H,5-6,11-15H2,1H3,(H,27,28)
NCI pathway
Reactome pathway
n/an/an/an/a 209n/an/an/an/a
Pfizer Global R&D
Curated by ChEMBL
Assay Description
Agonist activity at human PPAR gamma in a HepG2 cells by PPAR-GAL4 transactivation assay
Bioorg Med Chem Lett 16: 6120-3 (2006)
Article DOI: 10.1016/j.bmcl.2006.08.110
BindingDB Entry DOI: 10.7270/Q20Z72XV