BDBM50194961 2-((6-(2-(5-methyl-2-m-tolyloxazol-4-yl)ethoxy)pyridin-3-yl)methyl)-tetrahydrofuran-2-carboxylic acid::CHEMBL374448
SMILES: Cc1oc(nc1CCOc1ccc(CC2(CCCO2)C(O)=O)cn1)-c1cccc(C)c1
InChI Key: InChIKey=KBOLGLHRFVZEAM-UHFFFAOYSA-N
Data: 1 KI  3 EC50
Activity Spreadsheet -- Enzyme Inhibition Constant Data from BindingDB
Found 4 hits for monomerid = 50194961
Trg + Lig
Ki
nM
ΔG°
kcal/mole
IC50
nM
Kd
nM
EC50/IC50
nM
koff
s-1
kon
M-1s-1
pHTemp
°C
Peroxisome proliferator-activated receptor
(Homo sapiens (Human))
BDBM50194961
(2-((6-(2-(5-methyl-2-m-tolyloxazol-4-yl)ethoxy)pyr...)
Show SMILES Cc1oc(nc1CCOc1ccc(CC2(CCCO2)C(O)=O)cn1)-c1cccc(C)c1
Show InChI InChI=1S/C24H26N2O5/c1-16-5-3-6-19(13-16)22-26-20(17(2)31-22)9-12-29-21-8-7-18(15-25-21)14-24(23(27)28)10-4-11-30-24/h3,5-8,13,15H,4,9-12,14H2,1-2H3,(H,27,28)
NCI pathway
Reactome pathway
16n/an/an/an/an/an/an/an/a
Pfizer Global R&D
Curated by ChEMBL
Assay Description
Displacement of radiolabeled darglitazone from human PPAR gamma by SPA binding assay
Bioorg Med Chem Lett 16: 6120-3 (2006)
Article DOI: 10.1016/j.bmcl.2006.08.110
BindingDB Entry DOI: 10.7270/Q20Z72XV
Peroxisome proliferator-activated receptor alpha (PPAR alpha)
(Homo sapiens (Human))
BDBM50194961
(2-((6-(2-(5-methyl-2-m-tolyloxazol-4-yl)ethoxy)pyr...)
Show SMILES Cc1oc(nc1CCOc1ccc(CC2(CCCO2)C(O)=O)cn1)-c1cccc(C)c1
Show InChI InChI=1S/C24H26N2O5/c1-16-5-3-6-19(13-16)22-26-20(17(2)31-22)9-12-29-21-8-7-18(15-25-21)14-24(23(27)28)10-4-11-30-24/h3,5-8,13,15H,4,9-12,14H2,1-2H3,(H,27,28)
n/an/an/an/a 277n/an/an/an/a
Pfizer Global R&D
Curated by ChEMBL
Assay Description
Displacement of radiolabeled GW2331 from human PPAR alpha by SPA binding assay
Bioorg Med Chem Lett 16: 6120-3 (2006)
Article DOI: 10.1016/j.bmcl.2006.08.110
BindingDB Entry DOI: 10.7270/Q20Z72XV
Peroxisome proliferator-activated receptor
(Homo sapiens (Human))
BDBM50194961
(2-((6-(2-(5-methyl-2-m-tolyloxazol-4-yl)ethoxy)pyr...)
Show SMILES Cc1oc(nc1CCOc1ccc(CC2(CCCO2)C(O)=O)cn1)-c1cccc(C)c1
Show InChI InChI=1S/C24H26N2O5/c1-16-5-3-6-19(13-16)22-26-20(17(2)31-22)9-12-29-21-8-7-18(15-25-21)14-24(23(27)28)10-4-11-30-24/h3,5-8,13,15H,4,9-12,14H2,1-2H3,(H,27,28)
NCI pathway
Reactome pathway
n/an/an/an/a 5n/an/an/an/a
Pfizer Global R&D
Curated by ChEMBL
Assay Description
Agonist activity at human PPAR gamma in a HepG2 cells by PPAR-GAL4 transactivation assay
Bioorg Med Chem Lett 16: 6120-3 (2006)
Article DOI: 10.1016/j.bmcl.2006.08.110
BindingDB Entry DOI: 10.7270/Q20Z72XV
Peroxisome proliferator-activated receptor alpha (PPAR alpha)
(Homo sapiens (Human))
BDBM50194961
(2-((6-(2-(5-methyl-2-m-tolyloxazol-4-yl)ethoxy)pyr...)
Show SMILES Cc1oc(nc1CCOc1ccc(CC2(CCCO2)C(O)=O)cn1)-c1cccc(C)c1
Show InChI InChI=1S/C24H26N2O5/c1-16-5-3-6-19(13-16)22-26-20(17(2)31-22)9-12-29-21-8-7-18(15-25-21)14-24(23(27)28)10-4-11-30-24/h3,5-8,13,15H,4,9-12,14H2,1-2H3,(H,27,28)
n/an/an/an/a 134n/an/an/an/a
Pfizer Global R&D
Curated by ChEMBL
Assay Description
Agonist activity at human PPAR alpha in a HepG2 cells by PPAR-GAL4 transactivation assay
Bioorg Med Chem Lett 16: 6120-3 (2006)
Article DOI: 10.1016/j.bmcl.2006.08.110
BindingDB Entry DOI: 10.7270/Q20Z72XV